* Package:    app-backup/bareos-21.1.5-r2:0
 * Repository: gentoo
 * Maintainer: mschiff@gentoo.org
 * USE:        abi_x86_64 acl amd64 director elibc_glibc ipv6 kernel_linux readline split-usr storage-daemon userland_GNU xattr
 * FEATURES:   network-sandbox preserve-libs sandbox userpriv usersandbox


@@@@@ PLEASE PAY ATTENTION HERE!!! @@@@@
This information may help you to understand if this is a duplicate or if this bug exists after you pushed a fix;
This ebuild was merged at the following commit:
https://github.com/gentoo-mirror/gentoo/commit/0035269e0038714db630df9946ad63d43b9d53f5  (Fri Feb 17 20:02:05 UTC 2023)
@@@@@ END @@@@@



##################
# emerge --info: #
##################
Portage 3.0.44 (python 3.11.2-final-0, default/linux/amd64/17.1, gcc-13, glibc-2.36-r7, 5.15.85-gentoo-dist x86_64)
=================================================================
System uname: Linux-5.15.85-gentoo-dist-x86_64-AMD_EPYC_7513_32-Core_Processor-with-glibc2.36
KiB Mem:   263532996 total,  23800980 free
KiB Swap:          0 total,         0 free
Timestamp of repository gentoo: Fri, 17 Feb 2023 20:02:05 +0000
sh bash 5.2_p15-r2
ld GNU ld (Gentoo 2.40 p2) 2.40.0
app-misc/pax-utils:        1.3.7::gentoo
app-shells/bash:           5.2_p15-r2::gentoo
dev-lang/perl:             5.36.0-r2::gentoo
dev-lang/python:           3.9.16_p1::gentoo, 3.10.10_p1::gentoo, 3.11.2_p1::gentoo
dev-util/cmake:            3.25.2::gentoo
dev-util/meson:            1.0.0::gentoo
sys-apps/baselayout:       2.13-r1::gentoo
sys-apps/openrc:           0.46::gentoo
sys-apps/sandbox:          2.30-r1::gentoo
sys-devel/autoconf:        2.71-r5::gentoo
sys-devel/automake:        1.16.5::gentoo
sys-devel/binutils:        2.40-r1::gentoo
sys-devel/binutils-config: 5.5::gentoo
sys-devel/gcc:             13.0.1_pre20230212::gentoo
sys-devel/gcc-config:      2.10::gentoo
sys-devel/libtool:         2.4.7-r1::gentoo
sys-devel/make:            4.4::gentoo
sys-kernel/linux-headers:  6.1::gentoo (virtual/os-headers)
sys-libs/glibc:            2.36-r7::gentoo
Repositories:

gentoo
    location: /usr/portage
    sync-type: rsync
    sync-uri: rsync://rsync.gentoo.org/gentoo-portage
    priority: -1000
    volatile: True
    sync-rsync-verify-max-age: 24
    sync-rsync-extra-opts: 
    sync-rsync-verify-jobs: 1
    sync-rsync-verify-metamanifest: yes

ACCEPT_KEYWORDS="amd64 ~amd64"
ACCEPT_LICENSE="* AGPL-3"
CBUILD="x86_64-pc-linux-gnu"
CFLAGS="-O2 -march=x86-64 -pipe -pipe -frecord-gcc-switches -fno-diagnostics-color -fmessage-length=0"
CHOST="x86_64-pc-linux-gnu"
CONFIG_PROTECT="/etc /usr/share/gnupg/qualified.txt"
CONFIG_PROTECT_MASK="/etc/ca-certificates.conf /etc/env.d /etc/fonts/fonts.conf /etc/gconf /etc/gentoo-release /etc/revdep-rebuild /etc/sandbox.d /etc/terminfo"
CXXFLAGS="-O2 -march=x86-64 -pipe -pipe -frecord-gcc-switches -fno-diagnostics-color -fmessage-length=0"
DISTDIR="/var/tmp/portage/app-backup/bareos-21.1.5-r2/distdir"
EMERGE_DEFAULT_OPTS="--with-bdeps=y -1 -k -b"
ENV_UNSET="CARGO_HOME DBUS_SESSION_BUS_ADDRESS DISPLAY GDK_PIXBUF_MODULE_FILE GOBIN GOPATH PERL5LIB PERL5OPT PERLPREFIX PERL_CORE PERL_MB_OPT PERL_MM_OPT XAUTHORITY XDG_CACHE_HOME XDG_CONFIG_HOME XDG_DATA_HOME XDG_RUNTIME_DIR XDG_STATE_HOME"
FCFLAGS="-O2 -march=x86-64 -pipe -pipe -frecord-gcc-switches -fno-diagnostics-color -fmessage-length=0"
FEATURES="assume-digests binpkg-docompress binpkg-dostrip binpkg-logs binpkg-multi-instance buildpkg buildpkg-live config-protect-if-modified distlocks ebuild-locks fixlafiles ipc-sandbox merge-sync multilib-strict network-sandbox news parallel-fetch pid-sandbox preserve-libs protect-owned qa-unresolved-soname-deps sandbox sfperms sign split-log strict unknown-features-warn unmerge-logs unmerge-orphans userfetch userpriv usersandbox usersync xattr"
FFLAGS="-O2 -march=x86-64 -pipe -pipe -frecord-gcc-switches -fno-diagnostics-color -fmessage-length=0"
GENTOO_MIRRORS="http://mirror.leaseweb.com/gentoo/ http://ftp.snt.utwente.nl/pub/os/linux/gentoo/ http://ftp.belnet.be/pub/rsync.gentoo.org/gentoo/ http://distfiles.gentoo.org"
LANG="en_US.utf8"
LDFLAGS="-Wl,-O1 -Wl,--as-needed -Wl,--defsym=__gentoo_check_ldflags__=0"
LEX="flex"
MAKEOPTS="-j16"
PKGDIR="/root/tbci/binpkg"
PORTAGE_CONFIGROOT="/"
PORTAGE_RSYNC_OPTS="--recursive --links --safe-links --perms --times --omit-dir-times --compress --force --whole-file --delete --stats --human-readable --timeout=180 --exclude=/distfiles --exclude=/local --exclude=/packages --exclude=/.git"
PORTAGE_TMPDIR="/var/tmp"
SHELL="/bin/bash"
USE="acl amd64 bzip2 cli crypt debug director dri elogind fortran gdbm iconv ipv6 jumbo-build libglvnd libtirpc multilib native-symlinks ncurses nls nptl openmp pam pcre readline seccomp split-usr ssl storage-daemon test-rust unicode xattr zlib" ABI_X86="64" ELIBC="glibc" KERNEL="linux" USERLAND="GNU"
Unset:  ADDR2LINE, AR, ARFLAGS, AS, ASFLAGS, CC, CCLD, CONFIG_SHELL, CPP, CPPFLAGS, CTARGET, CXX, CXXFILT, ELFEDIT, EXTRA_ECONF, F77FLAGS, FC, GCOV, GPROF, INSTALL_MASK, LC_ALL, LD, LFLAGS, LIBTOOL, LINGUAS, MAKE, MAKEFLAGS, NM, OBJCOPY, OBJDUMP, PORTAGE_BINHOST, PORTAGE_BUNZIP2_COMMAND, PORTAGE_COMPRESS, PORTAGE_COMPRESS_FLAGS, PORTAGE_RSYNC_EXTRA_OPTS, RANLIB, READELF, RUSTFLAGS, SIZE, STRINGS, STRIP, YACC, YFLAGS





##############################
# emerge history (qlop -mv): #
##############################
2023-02-17T21:17:39 >>> acct-group/nullmail-0
2023-02-17T21:17:39 >>> sys-block/mtx-1.3.12
2023-02-17T21:17:40 >>> app-arch/mt-st-1.4
2023-02-17T21:17:38 >>> acct-group/bareos-0-r1
2023-02-17T21:17:38 >>> acct-group/postgres-0-r1
2023-02-17T21:17:41 >>> app-admin/metalog-20220214
2023-02-17T21:17:43 >>> acct-user/nullmail-0
2023-02-17T21:17:40 >>> app-eselect/eselect-postgresql-2.4-r1
2023-02-17T21:17:40 >>> dev-libs/jansson-2.14-r1
2023-02-17T21:17:48 >>> acct-user/bareos-0-r1
2023-02-17T21:17:51 >>> virtual/logger-0-r1
2023-02-17T21:18:00 >>> mail-mta/nullmailer-2.2-r2
2023-02-17T21:18:02 >>> virtual/mta-1-r2
2023-02-17T21:17:50 >>> acct-user/postgres-0-r1
2023-02-17T21:18:05 >>> dev-db/postgresql-15.2




#######################################
# installed packages (qlist -ICvUSS): #
#######################################
acct-group/audio-0-r1:0
acct-group/bareos-0-r1:0
acct-group/cdrom-0-r1:0
acct-group/dialout-0-r1:0
acct-group/disk-0-r1:0
acct-group/floppy-0:0
acct-group/input-0-r1:0
acct-group/kmem-0-r1:0
acct-group/kvm-0-r1:0
acct-group/lp-0-r1:0
acct-group/man-0-r1:0
acct-group/messagebus-0-r1:0
acct-group/nullmail-0:0
acct-group/polkitd-0-r1:0
acct-group/portage-0:0
acct-group/postgres-0-r1:0
acct-group/render-0-r1:0
acct-group/root-0:0
acct-group/sgx-0:0
acct-group/sshd-0-r1:0
acct-group/tape-0-r1:0
acct-group/tty-0-r1:0
acct-group/usb-0-r1:0
acct-group/video-0-r1:0
acct-user/bareos-0-r1:0
acct-user/man-1-r1:0
acct-user/messagebus-0-r1:0
acct-user/nullmail-0:0
acct-user/polkitd-0-r1:0
acct-user/portage-0:0
acct-user/postgres-0-r1:0
acct-user/sshd-0-r1:0
app-admin/eselect-1.4.20:0 -doc -emacs -vim-syntax
app-admin/metalog-20220214:0 unicode
app-admin/perl-cleaner-2.30-r1:0 -pkgcore
app-alternatives/awk-4:0 -busybox gawk -mawk -nawk split-usr
app-alternatives/bc-0:0 -gh gnu
app-alternatives/bzip2-1:0 -lbzip2 -pbzip2 reference split-usr
app-alternatives/gzip-0:0 -pigz reference split-usr
app-alternatives/lex-0-r1:0 flex -reflex
app-alternatives/sh-0:0 bash -busybox -dash -ksh -lksh -mksh
app-alternatives/tar-0:0 gnu -libarchive split-usr
app-alternatives/yacc-1-r2:0 bison -byacc -reference
app-arch/bzip2-1.0.8-r4:0/1 -abi_mips_n32 -abi_mips_n64 -abi_mips_o32 -abi_s390_32 -abi_s390_64 -abi_x86_32 abi_x86_64 -abi_x86_x32 split-usr -static -static-libs -verify-sig
app-arch/gzip-1.12-r4:0 -pic -static -verify-sig
app-arch/libarchive-3.6.1-r1:0/13 -abi_mips_n32 -abi_mips_n64 -abi_mips_o32 -abi_s390_32 -abi_s390_64 -abi_x86_32 abi_x86_64 -abi_x86_x32 acl -blake2 bzip2 e2fsprogs -expat iconv -lz4 lzma -lzo -nettle -static-libs -verify-sig xattr -zstd
app-arch/mt-st-1.4:0
app-arch/tar-1.34-r2:0 acl -minimal nls -selinux -verify-sig xattr
app-arch/unzip-6.0_p27-r1:0 bzip2 -natspec unicode
app-arch/xz-utils-5.4.1:0 -abi_mips_n32 -abi_mips_n64 -abi_mips_o32 -abi_s390_32 -abi_s390_64 -abi_x86_32 abi_x86_64 -abi_x86_x32 extra-filters nls split-usr -static-libs -verify-sig
app-arch/zstd-1.5.4-r2:0/1 -abi_mips_n32 -abi_mips_n64 -abi_mips_o32 -abi_s390_32 -abi_s390_64 -abi_x86_32 abi_x86_64 -abi_x86_x32 -lz4 lzma split-usr -static-libs -test zlib
app-crypt/gnupg-2.4.0:0 bzip2 -doc -ldap nls readline -selinux smartcard ssl -test tofu -tools -tpm -usb -user-socket -verify-sig -wks-server
app-crypt/gpgme-1.18.0-r2:1/11.6.15.1 -common-lisp cxx -python python_targets_python3_10 python_targets_python3_11 python_targets_python3_9 -qt5 -static-libs -test -verify-sig
app-crypt/libb2-0.98.1-r3:0 -abi_mips_n32 -abi_mips_n64 -abi_mips_o32 -abi_s390_32 -abi_s390_64 -abi_x86_32 abi_x86_64 -abi_x86_x32 -native-cflags openmp -static-libs
app-crypt/pinentry-1.2.1-r1:0 -caps -efl -emacs -gnome-keyring -gtk ncurses -qt5 -verify-sig
app-crypt/rhash-1.4.3:0 -abi_mips_n32 -abi_mips_n64 -abi_mips_o32 -abi_s390_32 -abi_s390_64 -abi_x86_32 abi_x86_64 -abi_x86_x32 debug nls ssl -static-libs
app-editors/nano-7.2:0 -debug -justify -magic -minimal ncurses nls spell -static unicode
app-eselect/eselect-fontconfig-20220403:0
app-eselect/eselect-iptables-20220320:0
app-eselect/eselect-lib-bin-symlink-0.1.1-r1:0
app-eselect/eselect-pinentry-0.7.2-r1:0
app-eselect/eselect-postgresql-2.4-r1:0
app-i18n/man-pages-ja-20180315-r1:0
app-i18n/man-pages-l10n-4.17.0:0 l10n_cs l10n_da l10n_de l10n_el l10n_es l10n_fi l10n_fr l10n_hu l10n_id l10n_it l10n_mk l10n_nb l10n_nl l10n_pl l10n_pt-BR l10n_ro l10n_ru l10n_sr l10n_sv l10n_uk l10n_vi
app-i18n/man-pages-zh_CN-1.6.3.6:0
app-misc/ca-certificates-20211016.3.88.1:0 -cacert
app-misc/editor-wrapper-4-r1:0
app-misc/mime-types-2.1.53:0 -nginx
app-misc/pax-utils-1.3.7:0 -caps -man -python python_single_target_python3_10 -python_single_target_python3_11 -python_single_target_python3_9 -seccomp -test
app-misc/tmux-3.3a-r1:0 debug -selinux -systemd -utempter -vim-syntax
app-portage/eix-0.36.6:0 debug -doc nls -sqlite
app-portage/elt-patches-20221210:0
app-portage/gemato-19.0:0 gpg -pretty-log python_targets_pypy3 python_targets_python3_10 python_targets_python3_11 python_targets_python3_9 -test -tools
app-portage/gentoolkit-0.6.1-r3:0 python_targets_pypy3 python_targets_python3_10 python_targets_python3_11 python_targets_python3_9 -test
app-portage/portage-utils-0.94.4:0 openmp qmanifest qtegrity -static
app-shells/bash-5.2_p15-r2:0 -afs -bashlogger -examples -mem-scramble net nls -pgo -plugins readline -verify-sig
app-shells/bash-completion-2.11:0 eselect -test
app-shells/gentoo-bashcomp-20190211-r1:0
app-shells/push-3.4:0
app-shells/quoter-4.2:0
app-text/ansifilter-2.18:0 -qt5
app-text/build-docbook-catalog-2.3-r1:0
app-text/docbook-xml-dtd-4.5-r2:4.5
app-text/docbook-xml-dtd-4.4-r3:4.4
app-text/docbook-xml-dtd-4.2-r3:4.2
app-text/docbook-xml-dtd-4.1.2-r7:4.1.2
app-text/docbook-xsl-stylesheets-1.79.1-r3:0 -ruby
app-text/manpager-1:0
app-text/opensp-1.5.2-r10:0 -doc nls -static-libs -test
app-text/po4a-0.69:0 -test -test
app-text/sgml-common-0.6.3-r7:0
app-text/xmlto-0.0.28-r10:0 -latex text
dev-db/postgresql-15.2:15 debug -doc -icu -kerberos -ldap -llvm -lz4 nls pam -perl -python python_single_target_python3_10 -python_single_target_python3_11 -python_single_target_python3_9 readline -selinux server ssl -static-libs -systemd -tcl threads -uuid -xml zlib -zstd
dev-db/sqlite-3.40.1:3 -abi_mips_n32 -abi_mips_n64 -abi_mips_o32 -abi_s390_32 -abi_s390_64 -abi_x86_32 abi_x86_64 -abi_x86_x32 debug -doc -icu readline -secure-delete -static-libs -tcl -test -tools
dev-lang/duktape-2.7.0-r3:0/2.7.0
dev-lang/perl-5.36.0-r2:0/5.36 -berkdb debug -doc gdbm ithreads -minimal -quadmath
dev-lang/python-3.11.2_p1:3.11 -bluetooth -build ensurepip -examples gdbm -hardened -libedit -lto ncurses -pgo readline sqlite ssl -test -tk -valgrind -verify-sig
dev-lang/python-3.10.10_p1:3.10 -bluetooth -build ensurepip -examples gdbm -hardened -libedit -lto ncurses -pgo readline sqlite ssl -test -tk -valgrind -verify-sig xml
dev-lang/python-3.9.16_p1:3.9 -bluetooth -build ensurepip -examples gdbm -hardened -lto ncurses -pgo readline sqlite ssl -test -tk -valgrind -verify-sig xml
dev-lang/python-exec-2.4.10:2 native-symlinks python_targets_pypy3 python_targets_python3_10 python_targets_python3_11 python_targets_python3_9 -test
dev-lang/python-exec-conf-2.4.6:2 python_targets_pypy3 python_targets_python3_10 python_targets_python3_11 python_targets_python3_9
dev-lang/tcl-8.6.13-r1:0/8.6 -abi_mips_n32 -abi_mips_n64 -abi_mips_o32 -abi_s390_32 -abi_s390_64 -abi_x86_32 abi_x86_64 -abi_x86_x32 debug threads
dev-libs/boehm-gc-8.2.2-r1:0 -abi_mips_n32 -abi_mips_n64 -abi_mips_o32 -abi_s390_32 -abi_s390_64 -abi_x86_32 abi_x86_64 -abi_x86_x32 -cxx large -static-libs threads
dev-libs/elfutils-0.188:0 -abi_mips_n32 -abi_mips_n64 -abi_mips_o32 -abi_s390_32 -abi_s390_64 -abi_x86_32 abi_x86_64 -abi_x86_x32 bzip2 -lzma nls -static-libs -test utils -valgrind -verify-sig -zstd
dev-libs/expat-2.5.0:0 -abi_mips_n32 -abi_mips_n64 -abi_mips_o32 -abi_s390_32 -abi_s390_64 -abi_x86_32 abi_x86_64 -abi_x86_x32 -examples -static-libs unicode
dev-libs/glib-2.74.5:2 -abi_mips_n32 -abi_mips_n64 -abi_mips_o32 -abi_s390_32 -abi_s390_64 -abi_x86_32 abi_x86_64 -abi_x86_x32 -dbus debug elf -gtk-doc mime -selinux -static-libs -sysprof -systemtap -test -utils xattr
dev-libs/gmp-6.2.1-r5:0/10.4 -abi_mips_n32 -abi_mips_n64 -abi_mips_o32 -abi_s390_32 -abi_s390_64 -abi_x86_32 abi_x86_64 -abi_x86_x32 asm cpudetection cxx -doc -pic -static-libs
dev-libs/gobject-introspection-1.74.0:0 -doctool -gtk-doc python_single_target_python3_10 -python_single_target_python3_11 -python_single_target_python3_9 -test
dev-libs/gobject-introspection-common-1.74.0:0
dev-libs/isl-0.24-r2:0/23 -abi_mips_n32 -abi_mips_n64 -abi_mips_o32 -abi_s390_32 -abi_s390_64 -abi_x86_32 abi_x86_64 -abi_x86_x32 -static-libs
dev-libs/jansson-2.14-r1:0/4 -doc -static-libs
dev-libs/jsoncpp-1.9.5:0/25 -doc -test
dev-libs/libassuan-2.5.5:0
dev-libs/libatomic_ops-7.6.14:0 -abi_mips_n32 -abi_mips_n64 -abi_mips_o32 -abi_s390_32 -abi_s390_64 -abi_x86_32 abi_x86_64 -abi_x86_x32
dev-libs/libevent-2.1.12-r1:0/2.1-7 -abi_mips_n32 -abi_mips_n64 -abi_mips_o32 -abi_s390_32 -abi_s390_64 -abi_x86_32 abi_x86_64 -abi_x86_x32 clock-gettime debug -malloc-replacement ssl -static-libs -test -verbose-debug
dev-libs/libffi-3.4.4:0/8 -abi_mips_n32 -abi_mips_n64 -abi_mips_o32 -abi_s390_32 -abi_s390_64 -abi_x86_32 abi_x86_64 -abi_x86_x32 debug -exec-static-trampoline -pax-kernel -static-libs -test
dev-libs/libgcrypt-1.10.1-r3:0/20 -abi_mips_n32 -abi_mips_n64 -abi_mips_o32 -abi_s390_32 -abi_s390_64 -abi_x86_32 abi_x86_64 -abi_x86_x32 asm -cpu_flags_arm_aes -cpu_flags_arm_neon -cpu_flags_arm_sha1 -cpu_flags_arm_sha2 -cpu_flags_ppc_altivec -cpu_flags_ppc_vsx2 -cpu_flags_ppc_vsx3 cpu_flags_x86_aes cpu_flags_x86_avx cpu_flags_x86_avx2 -cpu_flags_x86_padlock -cpu_flags_x86_sha cpu_flags_x86_sse4_1 -doc getentropy -static-libs -verify-sig
dev-libs/libgpg-error-1.46-r1:0 -abi_mips_n32 -abi_mips_n64 -abi_mips_o32 -abi_s390_32 -abi_s390_64 -abi_x86_32 abi_x86_64 -abi_x86_x32 -common-lisp nls -static-libs -test -verify-sig
dev-libs/libksba-1.6.3:0 -static-libs -verify-sig
dev-libs/libltdl-2.4.7-r1:0 -abi_mips_n32 -abi_mips_n64 -abi_mips_o32 -abi_s390_32 -abi_s390_64 -abi_x86_32 abi_x86_64 -abi_x86_x32 -static-libs
dev-libs/libpcre2-10.42-r1:0/3 -abi_mips_n32 -abi_mips_n64 -abi_mips_o32 -abi_s390_32 -abi_s390_64 -abi_x86_32 abi_x86_64 -abi_x86_x32 bzip2 jit -libedit pcre16 pcre32 readline split-usr -static-libs unicode -verify-sig zlib
dev-libs/libpipeline-1.5.7:0 -test
dev-libs/libtasn1-4.19.0:0/6 -abi_mips_n32 -abi_mips_n64 -abi_mips_o32 -abi_s390_32 -abi_s390_64 -abi_x86_32 abi_x86_64 -abi_x86_x32 -static-libs -test -valgrind -verify-sig
dev-libs/libunistring-1.1-r1:0/5 -abi_mips_n32 -abi_mips_n64 -abi_mips_o32 -abi_s390_32 -abi_s390_64 -abi_x86_32 abi_x86_64 -abi_x86_x32 -doc -static-libs
dev-libs/libuv-1.44.2-r1:0/1
dev-libs/libxml2-2.10.3-r1:2 -abi_mips_n32 -abi_mips_n64 -abi_mips_o32 -abi_s390_32 -abi_s390_64 -abi_x86_32 abi_x86_64 -abi_x86_x32 -debug -examples ftp -icu -lzma python python_targets_python3_10 python_targets_python3_11 python_targets_python3_9 readline -static-libs -test
dev-libs/libxslt-1.1.37-r1:0 -abi_mips_n32 -abi_mips_n64 -abi_mips_o32 -abi_s390_32 -abi_s390_64 -abi_x86_32 abi_x86_64 -abi_x86_x32 crypt debug -examples -python python_targets_python3_10 python_targets_python3_11 python_targets_python3_9 -static-libs
dev-libs/lzo-2.10:2 -abi_mips_n32 -abi_mips_n64 -abi_mips_o32 -abi_s390_32 -abi_s390_64 -abi_x86_32 abi_x86_64 -abi_x86_x32 -examples split-usr -static-libs
dev-libs/mpc-1.3.1:0/3 -abi_mips_n32 -abi_mips_n64 -abi_mips_o32 -abi_s390_32 -abi_s390_64 -abi_x86_32 abi_x86_64 -abi_x86_x32 -static-libs
dev-libs/mpfr-4.2.0:0/6 -abi_mips_n32 -abi_mips_n64 -abi_mips_o32 -abi_s390_32 -abi_s390_64 -abi_x86_32 abi_x86_64 -abi_x86_x32 -static-libs -verify-sig
dev-libs/nettle-3.8.1:0/8-6 -abi_mips_n32 -abi_mips_n64 -abi_mips_o32 -abi_s390_32 -abi_s390_64 -abi_x86_32 abi_x86_64 -abi_x86_x32 asm -cpu_flags_arm_aes -cpu_flags_arm_neon -cpu_flags_arm_sha1 -cpu_flags_arm_sha2 -cpu_flags_ppc_altivec cpu_flags_x86_aes cpu_flags_x86_pclmul -cpu_flags_x86_sha -doc gmp -static-libs -verify-sig
dev-libs/npth-1.6-r1:0 -test
dev-libs/openssl-3.0.8:0/3 -abi_mips_n32 -abi_mips_n64 -abi_mips_o32 -abi_s390_32 -abi_s390_64 -abi_x86_32 abi_x86_64 -abi_x86_x32 asm cpu_flags_x86_sse2 -fips -ktls -rfc3779 -sctp -static-libs -test -tls-compression -vanilla -verify-sig -verify-sig -weak-ssl-ciphers
dev-libs/popt-1.19:0 -abi_mips_n32 -abi_mips_n64 -abi_mips_o32 -abi_s390_32 -abi_s390_64 -abi_x86_32 abi_x86_64 -abi_x86_x32 nls -static-libs
dev-perl/Clone-0.460.0:0 -test
dev-perl/Devel-CheckLib-1.160.0:0 -test
dev-perl/Encode-EUCJPASCII-0.30.0-r1:0 -test
dev-perl/Encode-HanExtra-0.230.0-r3:0
dev-perl/Encode-Locale-1.50.0-r1:0 -test
dev-perl/ExtUtils-CChecker-0.110.0:0 -test
dev-perl/File-BaseDir-0.90.0:0 -test
dev-perl/File-DesktopEntry-0.220.0-r1:0 -test
dev-perl/File-Listing-6.150.0:0 -test -test
dev-perl/File-MimeInfo-0.300.0:0 -test
dev-perl/HTML-Parser-3.760.0:0 -test
dev-perl/HTML-Tagset-3.200.0-r2:0
dev-perl/HTTP-Cookies-6.100.0:0 -test
dev-perl/HTTP-Date-6.50.0:0
dev-perl/HTTP-Message-6.440.0:0 -test -test
dev-perl/HTTP-Negotiate-6.10.0-r2:0 -test
dev-perl/IO-HTML-1.4.0:0 -test
dev-perl/IO-Socket-INET6-2.720.0-r2:0 -test
dev-perl/IO-Socket-SSL-2.81.0:0 -examples -idn -test
dev-perl/IPC-System-Simple-1.300.0:0 -test
dev-perl/libwww-perl-6.600.0-r1:0 ssl -test
dev-perl/Locale-gettext-1.70.0-r1:0 -test
dev-perl/LWP-MediaTypes-6.40.0:0 -test
dev-perl/LWP-Protocol-https-6.100.0:0 -test
dev-perl/MIME-Charset-1.12.2-r1:0 l10n_ja l10n_zh -test
dev-perl/Module-Build-0.423.100:0 -test
dev-perl/Mozilla-CA-20999999-r1:0 -test
dev-perl/Net-HTTP-6.210.0:0 -minimal -test
dev-perl/Net-SSLeay-1.920.0:0 -examples -examples -minimal -test
dev-perl/Pod-Parser-1.630.0-r1:0 -test
dev-perl/SGMLSpm-1.1-r2:0 -test
dev-perl/Socket6-0.290.0:0 -test
dev-perl/Sub-Name-0.260.0:0 -suggested -test
dev-perl/Syntax-Keyword-Try-0.270.0:0 -test
dev-perl/TermReadKey-2.380.0-r1:0 -examples -test
dev-perl/Text-CharWidth-0.40.0-r2:0 -test
dev-perl/Text-WrapI18N-0.60.0-r2:0 -test
dev-perl/TimeDate-2.330.0-r1:0 -test
dev-perl/Try-Tiny-0.310.0:0 -minimal -test
dev-perl/Unicode-LineBreak-2019.1.0:0
dev-perl/URI-5.110.0:0 -test
dev-perl/WWW-RobotRules-6.20.0-r2:0 -test
dev-perl/XML-Parser-2.460.0-r2:0
dev-perl/XS-Parse-Keyword-0.250.0:0 -test
dev-perl/YAML-Tiny-1.730.0-r1:0 -minimal -test
dev-python/autocommand-2.2.2:0 python_targets_pypy3 python_targets_python3_10 python_targets_python3_11 python_targets_python3_9 -test
dev-python/certifi-3021.3.16-r3:0 python_targets_pypy3 python_targets_python3_10 python_targets_python3_11 python_targets_python3_9 -test
dev-python/charset_normalizer-3.0.1:0 python_targets_pypy3 python_targets_python3_10 python_targets_python3_11 python_targets_python3_9 -test
dev-python/cython-0.29.33:0 -doc -emacs python_targets_pypy3 python_targets_python3_10 python_targets_python3_11 python_targets_python3_9 -test
dev-python/ensurepip-pip-23.0:0
dev-python/ensurepip-setuptools-67.3.2:0
dev-python/ensurepip-wheels-100:0
dev-python/flit_core-3.8.0:0 python_targets_pypy3 python_targets_python3_10 python_targets_python3_11 python_targets_python3_9 -test
dev-python/gentoo-common-1:0
dev-python/gpep517-13:0 python_targets_pypy3 python_targets_python3_10 python_targets_python3_11 python_targets_python3_9 -test
dev-python/idna-3.4:0 python_targets_pypy3 python_targets_python3_10 python_targets_python3_11 python_targets_python3_9 -test
dev-python/importlib_metadata-6.0.0:0 python_targets_pypy3 python_targets_python3_10 python_targets_python3_11 python_targets_python3_9 -test
dev-python/inflect-6.0.2:0 python_targets_pypy3 python_targets_python3_10 python_targets_python3_11 python_targets_python3_9 -test
dev-python/installer-0.6.0:0 python_targets_pypy3 python_targets_python3_10 python_targets_python3_11 python_targets_python3_9 -test
dev-python/jaraco-context-4.3.0:0 python_targets_pypy3 python_targets_python3_10 python_targets_python3_11 python_targets_python3_9 -test
dev-python/jaraco-functools-3.5.2:0 python_targets_pypy3 python_targets_python3_10 python_targets_python3_11 python_targets_python3_9 -test
dev-python/jaraco-text-3.11.1:0 python_targets_pypy3 python_targets_python3_10 python_targets_python3_11 python_targets_python3_9 -test
dev-python/jinja-3.1.2:0 -doc -examples python_targets_pypy3 python_targets_python3_10 python_targets_python3_11 python_targets_python3_9 -test
dev-python/markupsafe-2.1.2:0 python_targets_pypy3 python_targets_python3_10 python_targets_python3_11 python_targets_python3_9 -test
dev-python/more-itertools-9.0.0:0 -doc python_targets_pypy3 python_targets_python3_10 python_targets_python3_11 python_targets_python3_9 -test
dev-python/nspektr-0.4.0:0 python_targets_pypy3 python_targets_python3_10 python_targets_python3_11 python_targets_python3_9 -test
dev-python/ordered-set-4.1.0:0 python_targets_pypy3 python_targets_python3_10 python_targets_python3_11 python_targets_python3_9 -test
dev-python/packaging-23.0-r1:0 python_targets_pypy3 python_targets_python3_10 python_targets_python3_11 python_targets_python3_9 -test
dev-python/platformdirs-3.0.0:0 python_targets_pypy3 python_targets_python3_10 python_targets_python3_11 python_targets_python3_9 -test
dev-python/pydantic-1.10.5:0 native-extensions python_targets_pypy3 python_targets_python3_10 python_targets_python3_11 python_targets_python3_9 -test
dev-python/pyparsing-3.0.9:0 -examples python_targets_pypy3 python_targets_python3_10 python_targets_python3_11 python_targets_python3_9 -test
dev-python/pypy3-7.3.11-r1:0/pypy39-pp73-336 ensurepip gdbm jit ncurses sqlite -tk
dev-python/pypy3-exe-bin-7.3.11:3.9-7.3.11
dev-python/PySocks-1.7.1-r2:0 python_targets_pypy3 python_targets_python3_10 python_targets_python3_11 python_targets_python3_9
dev-python/requests-2.28.2:0 python_targets_pypy3 python_targets_python3_10 python_targets_python3_11 python_targets_python3_9 -socks5 -test test-rust
dev-python/setuptools-67.3.2:0 python_targets_pypy3 python_targets_python3_10 python_targets_python3_11 python_targets_python3_9 -test
dev-python/setuptools_scm-7.1.0:0 python_targets_pypy3 python_targets_python3_10 python_targets_python3_11 python_targets_python3_9 -test
dev-python/six-1.16.0-r1:0 -doc python_targets_pypy3 python_targets_python3_10 python_targets_python3_11 python_targets_python3_9 -test
dev-python/tomli-2.0.1-r1:0 python_targets_pypy3 python_targets_python3_10 python_targets_python3_11 python_targets_python3_9 -test
dev-python/typing-extensions-4.5.0:0 python_targets_pypy3 python_targets_python3_10 python_targets_python3_11 python_targets_python3_9 -test
dev-python/urllib3-1.26.14:0 -brotli python_targets_pypy3 python_targets_python3_10 python_targets_python3_11 python_targets_python3_9 -test
dev-python/wheel-0.38.4:0 python_targets_pypy3 python_targets_python3_10 python_targets_python3_11 python_targets_python3_9 -test
dev-python/zipp-3.13.0:0 python_targets_pypy3 python_targets_python3_10 python_targets_python3_11 python_targets_python3_9 -test
dev-util/checkbashisms-2.22.2:0
dev-util/cmake-3.25.2:0 -doc -emacs ncurses -qt5 -test -test -verify-sig
dev-util/desktop-file-utils-0.26-r2:0 -emacs
dev-util/glib-utils-2.74.5:0 python_single_target_python3_10 -python_single_target_python3_11 -python_single_target_python3_9
dev-util/gperf-3.1-r1:0
dev-util/gtk-doc-am-1.33.2:0
dev-util/intltool-0.51.0-r3:0
dev-util/meson-1.0.0:0 python_targets_python3_10 python_targets_python3_11 python_targets_python3_9 -test
dev-util/meson-format-array-0:0 python_targets_python3_10 python_targets_python3_11 python_targets_python3_9
dev-util/ninja-1.11.1-r2:0 -doc -emacs -test
dev-util/pkgconf-1.8.1:0/3 -abi_mips_n32 -abi_mips_n64 -abi_mips_o32 -abi_s390_32 -abi_s390_64 -abi_x86_32 abi_x86_64 -abi_x86_x32 -test
dev-util/re2c-2.2:0 debug -test
dev-vcs/git-2.39.2:0 blksha1 -cgi curl -cvs -doc -gnome-keyring gpg -highlight iconv -mediawiki -mediawiki-experimental nls pcre -perforce -perl python_single_target_python3_10 -python_single_target_python3_11 -python_single_target_python3_9 safe-directory -selinux -subversion -test -tk webdav -xinetd
mail-mta/nullmailer-2.2-r2:0 ssl -test
media-fonts/liberation-fonts-2.1.5:0 -X -X -fontforge
media-gfx/graphite2-1.3.14_p20210810-r3:0 -abi_mips_n32 -abi_mips_n64 -abi_mips_o32 -abi_s390_32 -abi_s390_64 -abi_x86_32 abi_x86_64 -abi_x86_x32 -perl -test
media-libs/fontconfig-2.14.2:1.0 -abi_mips_n32 -abi_mips_n64 -abi_mips_o32 -abi_s390_32 -abi_s390_64 -abi_x86_32 abi_x86_64 -abi_x86_x32 -doc nls -test
media-libs/freetype-2.13.0:2 -X -abi_mips_n32 -abi_mips_n64 -abi_mips_o32 -abi_s390_32 -abi_s390_64 -abi_x86_32 abi_x86_64 -abi_x86_x32 adobe-cff -brotli bzip2 cleartype-hinting debug -doc -fontforge harfbuzz -infinality png -static-libs -svg -utils
media-libs/harfbuzz-6.0.0:0/6.0.0 -abi_mips_n32 -abi_mips_n64 -abi_mips_o32 -abi_s390_32 -abi_s390_64 -abi_x86_32 abi_x86_64 -abi_x86_x32 cairo debug -doc -experimental glib graphite -icu introspection -test truetype
media-libs/libpng-1.6.39:0/16 -abi_mips_n32 -abi_mips_n64 -abi_mips_o32 -abi_s390_32 -abi_s390_64 -abi_x86_32 abi_x86_64 -abi_x86_x32 -apng -cpu_flags_arm_neon cpu_flags_x86_sse -static-libs
net-dns/c-ares-1.19.0:0/2 -abi_mips_n32 -abi_mips_n64 -abi_mips_o32 -abi_s390_32 -abi_s390_64 -abi_x86_32 abi_x86_64 -abi_x86_x32 -static-libs -test -verify-sig
net-dns/libidn2-2.3.4:0/2 -abi_mips_n32 -abi_mips_n64 -abi_mips_o32 -abi_s390_32 -abi_s390_64 -abi_x86_32 abi_x86_64 -abi_x86_x32 nls -static-libs -verify-sig
net-firewall/iptables-1.8.9:0/1.8.3 -conntrack -netlink -nftables -pcap split-usr -static-libs
net-libs/gnutls-3.8.0:0/30.30 -abi_mips_n32 -abi_mips_n64 -abi_mips_o32 -abi_s390_32 -abi_s390_64 -abi_x86_32 abi_x86_64 -abi_x86_x32 -brotli cxx -dane -doc -examples idn nls openssl -pkcs11 seccomp -sslv2 -sslv3 -static-libs -test -test-full tls-heartbeat -tools -valgrind -verify-sig zlib -zstd
net-libs/libmnl-1.0.5:0/0.2.0 -examples -verify-sig
net-libs/libnsl-2.0.0-r1:0/3 -abi_mips_n32 -abi_mips_n64 -abi_mips_o32 -abi_s390_32 -abi_s390_64 -abi_x86_32 abi_x86_64 -abi_x86_x32 -static-libs
net-libs/libtirpc-1.3.3:0/3 -abi_mips_n32 -abi_mips_n64 -abi_mips_o32 -abi_s390_32 -abi_s390_64 -abi_x86_32 abi_x86_64 -abi_x86_x32 -kerberos split-usr -static-libs
net-libs/nghttp2-1.51.0:0/1.14 -abi_mips_n32 -abi_mips_n64 -abi_mips_o32 -abi_s390_32 -abi_s390_64 -abi_x86_32 abi_x86_64 -abi_x86_x32 -cxx debug -hpack-tools -jemalloc -static-libs -test -utils -xml
net-misc/curl-7.88.0-r1:0 -abi_mips_n32 -abi_mips_n64 -abi_mips_o32 -abi_s390_32 -abi_s390_64 -abi_x86_32 abi_x86_64 -abi_x86_x32 adns -alt-svc -brotli -curl_ssl_gnutls -curl_ssl_mbedtls -curl_ssl_nss curl_ssl_openssl -curl_ssl_rustls ftp -gnutls -gopher -hsts http2 -idn imap -kerberos -ldap -mbedtls -nghttp3 -nss openssl pop3 progress-meter -rtmp -rustls -samba smtp -ssh ssl -sslv3 -static-libs -telnet -test tftp -verify-sig -websockets -zstd
net-misc/dhcpcd-9.4.1:0 debug embedded ipv6 -privsep udev
net-misc/iputils-20221126:0 arping -caps -clockdiff -doc filecaps -idn nls -test -tracepath
net-misc/netifrc-0.7.3-r1:0 dhcp
net-misc/openssh-9.2_p1-r2:0 -X -X509 -abi_mips_n32 -audit -debug -hpn -kerberos -ldns -libedit -livecd pam -pie -sctp -security-key -selinux ssl -static -test -verify-sig -xmss
net-misc/rsync-3.2.7-r2:0 acl -examples iconv -lz4 python_single_target_python3_10 -python_single_target_python3_11 -python_single_target_python3_9 -rrsync ssl -stunnel -system-zlib -verify-sig xattr -xxhash -zstd
net-misc/wget-1.21.3-r1:0 -cookie-check debug -gnutls -idn ipv6 -metalink nls -ntlm pcre ssl -static -test -uuid -verify-sig zlib
perl-core/Compress-Raw-Zlib-2.202.0:0
perl-core/File-Temp-0.231.100:0
sec-keys/openpgp-keys-gentoo-release-20220101:0 -test
sys-apps/acl-2.3.1-r1:0 -abi_mips_n32 -abi_mips_n64 -abi_mips_o32 -abi_s390_32 -abi_s390_64 -abi_x86_32 abi_x86_64 -abi_x86_x32 nls split-usr -static-libs
sys-apps/attr-2.5.1-r2:0 -abi_mips_n32 -abi_mips_n64 -abi_mips_o32 -abi_s390_32 -abi_s390_64 -abi_x86_32 abi_x86_64 -abi_x86_x32 debug nls split-usr -static-libs
sys-apps/baselayout-2.13-r1:0 -build split-usr
sys-apps/coreutils-9.1-r2:0 acl -caps -gmp -hostname -kill -multicall nls openssl -selinux split-usr -static -test -vanilla -verify-sig xattr
sys-apps/dbus-1.15.4:0 -X -abi_mips_n32 -abi_mips_n64 -abi_mips_o32 -abi_s390_32 -abi_s390_64 -abi_x86_32 abi_x86_64 -abi_x86_x32 debug -doc elogind -selinux -static-libs -systemd -test -test
sys-apps/debianutils-5.7:0 installkernel -static
sys-apps/diffutils-3.9-r1:0 nls -static -verify-sig
sys-apps/file-5.44-r3:0 -abi_mips_n32 -abi_mips_n64 -abi_mips_o32 -abi_s390_32 -abi_s390_64 -abi_x86_32 abi_x86_64 -abi_x86_x32 bzip2 -lzip -lzma -python python_targets_python3_10 python_targets_python3_11 python_targets_python3_9 -seccomp -static-libs -verify-sig zlib -zstd
sys-apps/findutils-4.9.0-r2:0 nls -selinux -static -test -verify-sig
sys-apps/gawk-5.2.1:0 -mpfr nls -pma readline -verify-sig
sys-apps/gentoo-functions-0.19:0
sys-apps/grep-3.8-r1:0 egrep-fgrep nls pcre -static -verify-sig
sys-apps/groff-1.22.4:0 -X -examples -uchardet
sys-apps/help2man-1.49.3:0 nls
sys-apps/install-xattr-0.8-r1:0
sys-apps/iproute2-6.1.0-r1:0 -atm -berkdb -bpf -caps -elf iptables -libbsd -minimal -nfs -selinux split-usr
sys-apps/kbd-2.5.1:0 nls pam -test
sys-apps/kmod-30-r1:0 debug -doc lzma -pkcs7 -python python_targets_python3_10 python_targets_python3_11 python_targets_python3_9 -static-libs tools zlib zstd
sys-apps/less-608-r2:0 pcre unicode
sys-apps/man-db-2.11.2:0 manpager nls seccomp -selinux -static-libs zlib
sys-apps/man-pages-6.03:0 l10n_cs l10n_da l10n_de l10n_el l10n_es l10n_fi l10n_fr l10n_hu l10n_id l10n_it l10n_ja l10n_mk l10n_nb l10n_nl l10n_pl l10n_pt-BR l10n_ro l10n_ru l10n_sr l10n_sv l10n_uk l10n_vi l10n_zh-CN
sys-apps/miscfiles-1.5-r4:0 -minimal
sys-apps/net-tools-2.10:0 arp hostname ipv6 -nis nls -plipconfig -selinux -slattach -static
sys-apps/openrc-0.46:0 -audit -bash debug ncurses netifrc -newnet pam -selinux -sysv-utils unicode
sys-apps/portage-3.0.44:0 -apidoc -build -doc -gentoo-dev ipc native-extensions python_targets_pypy3 python_targets_python3_10 python_targets_python3_11 python_targets_python3_9 rsync-verify -selinux -test xattr
sys-apps/sandbox-2.30-r1:0 -abi_mips_n32 -abi_mips_n64 -abi_mips_o32 -abi_s390_32 -abi_s390_64 abi_x86_32 abi_x86_64 -abi_x86_x32 nnp
sys-apps/sed-4.9:0 acl nls -selinux -static -verify-sig
sys-apps/shadow-4.13-r2:0/4 acl -audit -bcrypt -cracklib nls pam -selinux -skey split-usr -su -verify-sig xattr
sys-apps/systemd-utils-252.6:0 -abi_mips_n32 -abi_mips_n64 -abi_mips_o32 -abi_s390_32 -abi_s390_64 -abi_x86_32 abi_x86_64 -abi_x86_x32 acl -boot kmod -selinux split-usr -split-usr -sysusers -test tmpfiles udev
sys-apps/sysvinit-3.06-r1:0 -ibm nls -selinux -static -verify-sig
sys-apps/texinfo-7.0.2:0 nls standalone -static
sys-apps/util-linux-2.38.1-r2:0 -abi_mips_n32 -abi_mips_n64 -abi_mips_o32 -abi_s390_32 -abi_s390_64 -abi_x86_32 abi_x86_64 -abi_x86_x32 -audit -build -caps cramfs -cryptsetup -fdformat hardlink -kill logger -magic ncurses nls pam -python python_targets_python3_10 python_targets_python3_11 python_targets_python3_9 readline -rtas -selinux -slang split-usr -static-libs su suid -systemd -test -tty-helpers -udev unicode -verify-sig
sys-apps/which-2.21:0
sys-auth/elogind-246.10-r2:0 acl -audit cgroup-hybrid debug -doc pam policykit -selinux -test
sys-auth/pambase-20220214:0 -caps -debug elogind -gnome-keyring -homed -minimal -mktemp nullok -pam_krb5 -pam_ssh passwdqc -pwhistory -pwquality -securetty -selinux sha512 -systemd -yescrypt
sys-auth/passwdqc-2.0.2-r1:0
sys-auth/polkit-122:0 daemon duktape -examples -gtk introspection -kde pam -selinux -systemd -test
sys-block/mtx-1.3.12:0
sys-devel/autoconf-2.71-r5:2.71 -emacs
sys-devel/autoconf-archive-2022.09.03:0
sys-devel/autoconf-wrapper-20221207-r1:0
sys-devel/automake-1.16.5:1.16 -test
sys-devel/automake-wrapper-20221207:0
sys-devel/bc-1.07.1-r6:0 -libedit readline -static
sys-devel/binutils-2.40-r1:2.40 -cet -doc -gold -gprofng -multitarget nls -pgo plugins -static-libs -test -vanilla -zstd
sys-devel/binutils-config-5.5:0 native-symlinks
sys-devel/bison-3.8.2-r2:0 -examples nls -static -test -verify-sig
sys-devel/flex-2.6.4-r5:0 -abi_mips_n32 -abi_mips_n64 -abi_mips_o32 -abi_s390_32 -abi_s390_64 -abi_x86_32 abi_x86_64 -abi_x86_x32 nls -static -test
sys-devel/gcc-13.0.1_pre20230212:13 -ada -cet -custom-cflags cxx -d -debug -default-stack-clash-protection -default-znow -doc -fixed-point fortran -go graphite -hardened -ieee-long-double -jit -libssp lto multilib nls nptl -objc -objc++ -objc-gc openmp -pch -pgo pie -rust sanitize ssp -systemtap -test -valgrind -vanilla -vtv -zstd
sys-devel/gcc-config-2.10:0 cc-wrappers native-symlinks
sys-devel/gettext-0.21.1:0 -abi_mips_n32 -abi_mips_n64 -abi_mips_o32 -abi_s390_32 -abi_s390_64 -abi_x86_32 abi_x86_64 -abi_x86_x32 acl -cvs cxx -doc -emacs -git -java -java ncurses nls openmp -static-libs -verify-sig
sys-devel/gnuconfig-20221007:0
sys-devel/libtool-2.4.7-r1:2 -vanilla
sys-devel/m4-1.4.19-r1:0 -examples nls -verify-sig
sys-devel/make-4.4:0 -guile nls -static -verify-sig
sys-devel/patch-2.7.6-r5:0 -static -test -verify-sig xattr
sys-fs/e2fsprogs-1.47.0:0 -abi_mips_n32 -abi_mips_n64 -abi_mips_o32 -abi_s390_32 -abi_s390_64 -abi_x86_32 abi_x86_64 -abi_x86_x32 -cron -fuse nls split-usr -static-libs -test tools
sys-fs/udev-init-scripts-35:0
sys-kernel/installkernel-gentoo-6:0 -grub
sys-kernel/linux-headers-6.1:0 -headers-only
sys-libs/gdbm-1.23:0/6 -abi_mips_n32 -abi_mips_n64 -abi_mips_o32 -abi_s390_32 -abi_s390_64 -abi_x86_32 abi_x86_64 -abi_x86_x32 berkdb nls readline -static-libs -test -verify-sig
sys-libs/glibc-2.36-r7:2.2 -audit -caps -cet -compile-locales -crypt -custom-cflags -doc -gd -hash-sysv-compat -headers-only multiarch multilib -multilib-bootstrap -nscd -perl -profile -selinux ssp stack-realign static-libs -suid -systemd -systemtap -test -vanilla
sys-libs/libcap-2.67:0 -abi_mips_n32 -abi_mips_n64 -abi_mips_o32 -abi_s390_32 -abi_s390_64 -abi_x86_32 abi_x86_64 -abi_x86_x32 pam split-usr -static-libs -tools
sys-libs/libseccomp-2.5.4:0 -abi_mips_n32 -abi_mips_n64 -abi_mips_o32 -abi_s390_32 -abi_s390_64 -abi_x86_32 abi_x86_64 -abi_x86_x32 -experimental-loong -python python_targets_python3_10 python_targets_python3_9 -static-libs -test
sys-libs/libxcrypt-4.4.33:0/1 -abi_mips_n32 -abi_mips_n64 -abi_mips_o32 -abi_s390_32 -abi_s390_64 abi_x86_32 abi_x86_64 -abi_x86_x32 compat -headers-only split-usr -static-libs system -test
sys-libs/ncurses-6.4:0/6 -abi_mips_n32 -abi_mips_n64 -abi_mips_o32 -abi_s390_32 -abi_s390_64 -abi_x86_32 abi_x86_64 -abi_x86_x32 -ada cxx debug -doc -gpm -minimal -profile split-usr -split-usr stack-realign -static-libs -test tinfo -trace -verify-sig
sys-libs/pam-1.5.2-r3:0 -abi_mips_n32 -abi_mips_n64 -abi_mips_o32 -abi_s390_32 -abi_s390_64 -abi_x86_32 abi_x86_64 -abi_x86_x32 -audit -berkdb -debug filecaps -nis -selinux split-usr
sys-libs/readline-8.2_p1:0/8 -abi_mips_n32 -abi_mips_n64 -abi_mips_o32 -abi_s390_32 -abi_s390_64 -abi_x86_32 abi_x86_64 -abi_x86_x32 split-usr -static-libs unicode -utils -verify-sig
sys-libs/timezone-data-2022g:0 -leaps-timezone nls -zic-slim
sys-libs/zlib-1.2.13-r1:0/1 -abi_mips_n32 -abi_mips_n64 -abi_mips_o32 -abi_s390_32 -abi_s390_64 -abi_x86_32 abi_x86_64 -abi_x86_x32 minizip split-usr -static-libs -verify-sig
sys-process/procps-3.3.17-r1:0/8 -abi_mips_n32 -abi_mips_n64 -abi_mips_o32 -abi_s390_32 -abi_s390_64 -abi_x86_32 abi_x86_64 -abi_x86_x32 elogind kill -modern-top ncurses nls -selinux split-usr -static-libs -systemd -test unicode
sys-process/psmisc-23.6:0 -X -apparmor nls -selinux -test
virtual/acl-0-r2:0 -abi_mips_n32 -abi_mips_n64 -abi_mips_o32 -abi_s390_32 -abi_s390_64 -abi_x86_32 abi_x86_64 -abi_x86_x32 -static-libs
virtual/dev-manager-0-r2:0
virtual/editor-0-r4:0
virtual/libc-1-r1:0
virtual/libcrypt-2-r1:0/2 -abi_mips_n32 -abi_mips_n64 -abi_mips_o32 -abi_s390_32 -abi_s390_64 abi_x86_32 abi_x86_64 -abi_x86_x32 -static-libs
virtual/libelf-3-r1:0/1 -abi_mips_n32 -abi_mips_n64 -abi_mips_o32 -abi_s390_32 -abi_s390_64 -abi_x86_32 abi_x86_64 -abi_x86_x32
virtual/libiconv-0-r2:0 -abi_mips_n32 -abi_mips_n64 -abi_mips_o32 -abi_s390_32 -abi_s390_64 -abi_x86_32 abi_x86_64 -abi_x86_x32
virtual/libintl-0-r2:0 -abi_mips_n32 -abi_mips_n64 -abi_mips_o32 -abi_s390_32 -abi_s390_64 -abi_x86_32 abi_x86_64 -abi_x86_x32
virtual/libudev-232-r7:0/1 -abi_mips_n32 -abi_mips_n64 -abi_mips_o32 -abi_s390_32 -abi_s390_64 -abi_x86_32 abi_x86_64 -abi_x86_x32 -systemd
virtual/logger-0-r1:0
virtual/man-0-r4:0
virtual/mta-1-r2:0
virtual/os-headers-0-r2:0
virtual/package-manager-1:0
virtual/pager-0-r1:0
virtual/perl-Carp-1.520.0-r2:0
virtual/perl-Compress-Raw-Bzip2-2.103.0-r3:0
virtual/perl-Compress-Raw-Zlib-2.202.0:0
virtual/perl-CPAN-2.330.0:0
virtual/perl-CPAN-Meta-2.150.10-r6:0
virtual/perl-CPAN-Meta-Requirements-2.140.0-r8:0
virtual/perl-CPAN-Meta-YAML-0.18.0-r8:0
virtual/perl-Data-Dumper-2.184.0:0
virtual/perl-Digest-MD5-2.580.0-r1:0
virtual/perl-Encode-3.170.0:0
virtual/perl-Exporter-5.770.0:0
virtual/perl-ExtUtils-CBuilder-0.280.236-r1:0
virtual/perl-ExtUtils-Install-2.200.0-r1:0
virtual/perl-ExtUtils-MakeMaker-7.640.0:0
virtual/perl-ExtUtils-Manifest-1.730.0-r1:0
virtual/perl-ExtUtils-ParseXS-3.450.0:0
virtual/perl-File-Path-2.180.0-r1:0
virtual/perl-File-Spec-3.840.0:0
virtual/perl-File-Temp-0.231.100:0
virtual/perl-Getopt-Long-2.520.0-r1:0
virtual/perl-IO-1.500.0:0
virtual/perl-IO-Compress-2.106.0:0
virtual/perl-IO-Socket-IP-0.410.0-r1:0
virtual/perl-JSON-PP-4.70.0:0
virtual/perl-libnet-3.140.0:0 ssl
virtual/perl-MIME-Base64-3.160.0-r1:0
virtual/perl-Module-Metadata-1.0.37-r2:0
virtual/perl-parent-0.238.0-r2:0
virtual/perl-Parse-CPAN-Meta-2.150.10-r6:0
virtual/perl-Perl-OSType-1.10.0-r6:0
virtual/perl-podlators-4.140.0-r3:0
virtual/perl-Scalar-List-Utils-1.620.0:0
virtual/perl-Test-Harness-3.440.0:0
virtual/perl-Text-ParseWords-3.310.0:0
virtual/perl-Time-Local-1.300.0-r1:0
virtual/perl-version-0.992.900:0
virtual/perl-XSLoader-0.310.0:0
virtual/pkgconfig-2-r1:0
virtual/service-manager-1-r1:0
virtual/ssh-0-r1:0 -minimal
virtual/tmpfiles-0-r3:0
virtual/ttf-fonts-1-r2:0
virtual/udev-217-r5:0
virtual/w3m-1:0
www-client/pybugz-0.13-r2:0 python_targets_python3_10 python_targets_python3_11 python_targets_python3_9
www-client/w3m-0.5.3_p20230121:0 -X -fbcon -gdk-pixbuf -gpm -imlib l10n_ja -lynxkeymap nls -nntp ssl unicode -xface
x11-apps/xprop-1.2.6:0
x11-apps/xset-1.2.5:0
x11-base/xcb-proto-1.15.2:0 python_targets_python3_10 python_targets_python3_11 python_targets_python3_9
x11-base/xorg-proto-2022.2:0 -test
x11-libs/cairo-1.17.6-r1:0 -X -abi_mips_n32 -abi_mips_n64 -abi_mips_o32 -abi_s390_32 -abi_s390_64 -abi_x86_32 abi_x86_64 -abi_x86_x32 -aqua -debug glib -gtk-doc -test
x11-libs/libICE-1.1.1-r1:0 -abi_mips_n32 -abi_mips_n64 -abi_mips_o32 -abi_s390_32 -abi_s390_64 -abi_x86_32 abi_x86_64 -abi_x86_x32
x11-libs/libSM-1.2.4:0 -abi_mips_n32 -abi_mips_n64 -abi_mips_o32 -abi_s390_32 -abi_s390_64 -abi_x86_32 abi_x86_64 -abi_x86_x32 -doc uuid
x11-libs/libX11-1.8.4:0 -abi_mips_n32 -abi_mips_n64 -abi_mips_o32 -abi_s390_32 -abi_s390_64 -abi_x86_32 abi_x86_64 -abi_x86_x32 -doc -test
x11-libs/libXau-1.0.11:0 -abi_mips_n32 -abi_mips_n64 -abi_mips_o32 -abi_s390_32 -abi_s390_64 -abi_x86_32 abi_x86_64 -abi_x86_x32 -doc
x11-libs/libxcb-1.15-r1:0/1.12 -abi_mips_n32 -abi_mips_n64 -abi_mips_o32 -abi_s390_32 -abi_s390_64 -abi_x86_32 abi_x86_64 -abi_x86_x32 -doc -doc -selinux -test xkb
x11-libs/libXdmcp-1.1.4-r2:0 -abi_mips_n32 -abi_mips_n64 -abi_mips_o32 -abi_s390_32 -abi_s390_64 -abi_x86_32 abi_x86_64 -abi_x86_x32 -doc
x11-libs/libXext-1.3.5:0 -abi_mips_n32 -abi_mips_n64 -abi_mips_o32 -abi_s390_32 -abi_s390_64 -abi_x86_32 abi_x86_64 -abi_x86_x32 -doc
x11-libs/libXmu-1.1.4:0 -abi_mips_n32 -abi_mips_n64 -abi_mips_o32 -abi_s390_32 -abi_s390_64 -abi_x86_32 abi_x86_64 -abi_x86_x32 -doc
x11-libs/libXt-1.2.1:0 -abi_mips_n32 -abi_mips_n64 -abi_mips_o32 -abi_s390_32 -abi_s390_64 -abi_x86_32 abi_x86_64 -abi_x86_x32 -doc -test
x11-libs/pixman-0.42.2:0 -abi_mips_n32 -abi_mips_n64 -abi_mips_o32 -abi_s390_32 -abi_s390_64 -abi_x86_32 abi_x86_64 -abi_x86_x32 -cpu_flags_arm_iwmmxt -cpu_flags_arm_iwmmxt2 -cpu_flags_arm_neon -cpu_flags_ppc_altivec cpu_flags_x86_mmxext cpu_flags_x86_sse2 cpu_flags_x86_ssse3 -loongson2f -static-libs -test
x11-libs/xtrans-1.4.0:0 -doc
x11-misc/compose-tables-1.8.4:0
x11-misc/shared-mime-info-2.2:0 -test
x11-misc/xdg-utils-1.1.3_p20210805-r1:0 -dbus -doc -gnome


#######################
# build.log           #
#######################
 * Checking whether python3_11 is suitable ...
 *   >=dev-lang/python-3.11.1-r1:3.11 ...
 [ ok ]
 * Using python3.11 to build (via PYTHON_COMPAT iteration)
>>> Unpacking source...
>>> Unpacking bareos-21.1.5.tar.gz to /var/tmp/portage/app-backup/bareos-21.1.5-r2/work
>>> Source unpacked in /var/tmp/portage/app-backup/bareos-21.1.5-r2/work
>>> Preparing source in /var/tmp/portage/app-backup/bareos-21.1.5-r2/work/bareos-Release-21.1.5 ...
 * Applying bareos-21-cmake-gentoo.patch ...
 [ ok ]
 * Applying bareos-21.1.2-werror.patch ...
 [ ok ]
 * Applying bareos-21.1.2-no-automagic-ccache.patch ...
 [ ok ]
 * Source directory (CMAKE_USE_DIR): "/var/tmp/portage/app-backup/bareos-21.1.5-r2/work/bareos-Release-21.1.5"
 * Build directory  (BUILD_DIR):     "/var/tmp/portage/app-backup/bareos-21.1.5-r2/work/bareos-21.1.5_build"
 * Hardcoded definition(s) removed in core/CMakeLists.txt:
 *    set(CMAKE_BUILD_TYPE Debug)
 *    set(CMAKE_INSTALL_PREFIX "${CMAKE_INSTALL_PREFIX}/${PROJECT_NAME}")
>>> Source prepared.
>>> Configuring source in /var/tmp/portage/app-backup/bareos-21.1.5-r2/work/bareos-Release-21.1.5 ...
 * Source directory (CMAKE_USE_DIR): "/var/tmp/portage/app-backup/bareos-21.1.5-r2/work/bareos-Release-21.1.5"
 * Build directory  (BUILD_DIR):     "/var/tmp/portage/app-backup/bareos-21.1.5-r2/work/bareos-21.1.5_build"
cmake --no-warn-unused-cli -C /var/tmp/portage/app-backup/bareos-21.1.5-r2/work/bareos-21.1.5_build/gentoo_common_config.cmake -G Ninja -DCMAKE_INSTALL_PREFIX=/usr -Dacl=yes -Dipv6=yes -Dndmp=no -Dscsi-crypto=no -Dsystemd=no -Dlmdb=no -DHAVE_PYTHON=0 -Darchivedir=/var/lib/bareos/storage -Dbackenddir=/usr/lib64/bareos/backend -Dbasename=localhost -Dbatch-insert=yes -Dbsrdir=/var/lib/bareos/bsr -Dconfdir=/etc/bareos -Dcoverage=no -Ddb_password=bUOcCXzcJeLk6fy9 -Ddir-group=bareos -Ddir-password=cyjjePByIkUSVeOKwLuqOnOfXs5yuuak -Ddir-user=bareos -Ddocdir=/usr/share/doc/bareos-21.1.5-r2 -Ddynamic-cats-backends=yes -Ddynamic-storage-backends=yes -Dfd-group=bareos -Dfd-password=d5dO9KuJ6DwXE0n1b0kpNul8NLpMqIVC -Dfd-user=root -Dhost=x86_64-pc-linux-gnu -Dhostname=localhost -Dhtmldir=/usr/share/doc/bareos-21.1.5-r2/html -Dlibdir=/usr/lib64 -Dlogdir=/var/log/bareos -Dmandir=/usr/share/man -Dmon-dir-password=n0miN184uVsLNdlROcDLEmDUCZBjkhq9 -Dmon-fd-password=BehLhZxIPpCZvc3Bsjmy9a416n1Uoyvl -Dmon-sd-password=CSBFl93KzGi12Js8QB5PBBOYH8yTuxj1 -Dopenssl=yes -Dpiddir=/run/bareos -Dplugindir=/usr/lib64/bareos/plugin -Dsbin-perm=0755 -Dsbindir=/usr/sbin -Dscriptdir=/usr/libexec/bareos -Dsd-group=bareos -Dsd-password=vmk5d4Gke07ECisBtVO4TplnufYPwYtQ -Dsd-user=root -Dsubsysdir=/run/lock/subsys -Dsysconfdir=/etc -Dworkingdir=/var/lib/bareos -Dx=no -DCMAKE_BUILD_TYPE=Gentoo -DCMAKE_TOOLCHAIN_FILE=/var/tmp/portage/app-backup/bareos-21.1.5-r2/work/bareos-21.1.5_build/gentoo_toolchain.cmake /var/tmp/portage/app-backup/bareos-21.1.5-r2/work/bareos-Release-21.1.5
Not searching for unused variables given on the command line.
loading initial cache file /var/tmp/portage/app-backup/bareos-21.1.5-r2/work/bareos-21.1.5_build/gentoo_common_config.cmake
Entering /var/tmp/portage/app-backup/bareos-21.1.5-r2/work/bareos-Release-21.1.5
-- Found Git: /usr/bin/git (found version "2.39.2") 
-- Using version information from /var/tmp/portage/app-backup/bareos-21.1.5-r2/work/bareos-Release-21.1.5/cmake/BareosVersion.cmake
BAREOS_NUMERIC_VERSION is 21.1.5
BAREOS_FULL_VERSION is 21.1.5
Entering /var/tmp/portage/app-backup/bareos-21.1.5-r2/work/bareos-Release-21.1.5/core
-- The C compiler identification is GNU 13.0.1
-- The CXX compiler identification is GNU 13.0.1
-- Detecting C compiler ABI info
-- Detecting C compiler ABI info - done
-- Check for working C compiler: /usr/bin/x86_64-pc-linux-gnu-gcc - skipped
-- Detecting C compile features
-- Detecting C compile features - done
-- Detecting CXX compiler ABI info
-- Detecting CXX compiler ABI info - done
-- Check for working CXX compiler: /usr/bin/x86_64-pc-linux-gnu-g++ - skipped
-- Detecting CXX compile features
-- Detecting CXX compile features - done
-- Performing Test LD_SUPPORTS_AS_NEEDED
-- Performing Test LD_SUPPORTS_AS_NEEDED - Success
-- Performing Test compiler_will_suggest_override
-- Performing Test compiler_will_suggest_override - Success
-- Performing Test compiler_format_security
-- Performing Test compiler_format_security - Success
-- Performing Test compiler_error_format_security
-- Performing Test compiler_error_format_security - Success
-- Performing Test c_compiler_debug_prefix_map
-- Performing Test c_compiler_debug_prefix_map - Success
-- Performing Test cxx_compiler_debug_prefix_map
-- Performing Test cxx_compiler_debug_prefix_map - Success
-- Performing Test c_compiler_macro_prefix_map
-- Performing Test c_compiler_macro_prefix_map - Success
-- Performing Test cxx_compiler_macro_prefix_map
-- Performing Test cxx_compiler_macro_prefix_map - Success
-- Performing Test compiler_has_no_unknown_pragmas
-- Performing Test compiler_has_no_unknown_pragmas - Success
-- Found PkgConfig: /usr/bin/x86_64-pc-linux-gnu-pkg-config (found version "1.8.1") 
-- Checking for module 'systemd'
--   Package 'systemd', required by 'virtual:world', not found
-- Could NOT find Python2 (missing: Python2_EXECUTABLE Python2_INCLUDE_DIRS Python2_LIBRARIES Interpreter Development Development.Module Development.Embed) 
    Reason given by package: 
        Interpreter: Wrong major version for the interpreter "/usr/bin/python"

-- Found Python3: /var/tmp/portage/app-backup/bareos-21.1.5-r2/temp/python3.11/bin/python3 (found version "3.11.2") found components: Interpreter Development Development.Module Development.Embed 
-- Python3_CC is  x86_64-pc-linux-gnu-gcc
-- Python3_CC_FLAGS is  
-- Python3_BLDSHARED is  x86_64-pc-linux-gnu-gcc -shared
-- Python3_BLDSHARED_FLAGS is  -shared
-- Python3_CFLAGS is  -Wsign-compare -DNDEBUG
-- Python3_CCSHARED is  -fPIC
-- Python3_INCLUDEPY is  /usr/include/python3.11
-- Python3_LDFLAGS is  
-- Python3_EXT_SUFFIX is  .cpython-311-x86_64-linux-gnu.so
-- Found PostgreSQL: /usr/lib64/libpq.so (found version "15.2")  
-- Found OpenSSL: /usr/lib64/libcrypto.so (found version "3.0.8")  
-- checking for library vixDiskLib and vixDiskLib.h header ...
--   HAVE_VIXDISKLIB=0
--               ERROR:  vixDiskLib libraries NOT found. 
--               ERROR:  vixDiskLib includes  NOT found. 
--   VIXDISKLIB_FOUND=FALSE
--   VIXDISKLIB_LIBRARIES=
--   VIXDISKLIB_INCLUDE_DIRS=
--   HAVE_VIXDISKLIB=0
-- checking for library rados and rados/librados.h header ...
--   HAVE_RADOS=0
--               ERROR:  rados libraries NOT found. 
--               ERROR:  rados includes  NOT found. 
--   RADOS_FOUND=FALSE
--   RADOS_LIBRARIES=
--   RADOS_INCLUDE_DIRS=
--   HAVE_RADOS=0
-- checking for library radosstriper and radosstriper/libradosstriper.h header ...
--   HAVE_RADOSSTRIPER=0
--               ERROR:  radosstriper libraries NOT found. 
--               ERROR:  radosstriper includes  NOT found. 
--   RADOSSTRIPER_FOUND=FALSE
--   RADOSSTRIPER_LIBRARIES=
--   RADOSSTRIPER_INCLUDE_DIRS=
--   HAVE_RADOSSTRIPER=0
-- checking for library cephfs and cephfs/libcephfs.h header ...
--   HAVE_CEPHFS=0
--               ERROR:  cephfs libraries NOT found. 
--               ERROR:  cephfs includes  NOT found. 
--   CEPHFS_FOUND=FALSE
--   CEPHFS_LIBRARIES=
--   CEPHFS_INCLUDE_DIRS=
--   HAVE_CEPHFS=0
-- checking for library pthread and pthread.h header ...
--   PTHREAD_FOUND=TRUE
--   PTHREAD_LIBRARIES=/usr/lib64/libpthread.a
--   PTHREAD_INCLUDE_DIRS=/usr/include
--   HAVE_PTHREAD=1
-- checking for library cap and sys/capability.h header ...
--   CAP_FOUND=TRUE
--   CAP_LIBRARIES=/usr/lib64/libcap.so
--   CAP_INCLUDE_DIRS=/usr/include
--   HAVE_CAP=1
-- checking for library gfapi and glusterfs/api/glfs.h header ...
--   HAVE_GFAPI=0
--               ERROR:  gfapi libraries NOT found. 
--               ERROR:  gfapi includes  NOT found. 
--   GFAPI_FOUND=FALSE
--   GFAPI_LIBRARIES=
--   GFAPI_INCLUDE_DIRS=
--   HAVE_GFAPI=0
-- checking for library pam and security/pam_appl.h header ...
--   PAM_FOUND=TRUE
--   PAM_LIBRARIES=/usr/lib64/libpam.so
--   PAM_INCLUDE_DIRS=/usr/include
--   HAVE_PAM=1
-- checking for library lzo2 and lzo/lzoconf.h header ...
--   LZO2_FOUND=TRUE
--   LZO2_LIBRARIES=/usr/lib64/liblzo2.so
--   LZO2_INCLUDE_DIRS=/usr/include
--   HAVE_LZO2=1
-- checking for library tirpc...
--   TIRPC_FOUND=TRUE
--   TIRPC_LIBRARIES=/usr/lib64/libtirpc.so
--   HAVE_LIBTIRPC=1
-- checking for library util...
--   UTIL_FOUND=TRUE
--   UTIL_LIBRARIES=/usr/lib64/libutil.a
--   HAVE_LIBUTIL=1
-- checking for library dl...
--   DL_FOUND=TRUE
--   DL_LIBRARIES=/usr/lib64/libdl.a
--   HAVE_LIBDL=1
-- checking for library acl...
--   ACL_FOUND=TRUE
--   ACL_LIBRARIES=/usr/lib64/libacl.so
--   HAVE_LIBACL=1
-- Could NOT find GTest (missing: GTest_DIR)
-- Found ZLIB: /usr/lib64/libz.so (found version "1.2.13") 
-- Found Readline: /usr/include  
-- Found Jansson: /usr/lib64/libjansson.so (found version "2.14") 
-- Performing Test CMAKE_HAVE_LIBC_PTHREAD
-- Performing Test CMAKE_HAVE_LIBC_PTHREAD - Success
-- Found Threads: TRUE  
-- Looking for include files pthread.h, pthread_np.h
-- Looking for include files pthread.h, pthread_np.h - not found
-- Performing Test HAVE_PTHREAD_ATTR_GET_NP
-- Performing Test HAVE_PTHREAD_ATTR_GET_NP - Failed
-- Looking for mysqld in version MySQL
-- Looking for mysql in version MySQL
-- XTRABACKUP_BINARY: XTRABACKUP_BINARY-NOTFOUND
-- MYSQL_DAEMON_BINARY:MYSQL_DAEMON_BINARY-NOTFOUND
-- MYSQL_CLIENT_BINARY:MYSQL_CLIENT_BINARY-NOTFOUND
-- Looking for mysqld in version MariaDB
-- Looking for mysql in version MariaDB
-- MARIABACKUP_BINARY: MARIABACKUP_BINARY-NOTFOUND
-- MARIADB_DAEMON_BINARY:MARIADB_DAEMON_BINARY-NOTFOUND
-- MARIADB_CLIENT_BINARY: MARIADB_CLIENT_BINARY-NOTFOUND
-- MARIADB_MYSQL_INSTALL_DB_SCRIPT: MARIADB_MYSQL_INSTALL_DB_SCRIPT-NOTFOUND
-- Found Intl: built in to C library  
-- set bindir to default /usr/bin
-- VERSION: 
-- PROJECT_SOURCE_DIR:         /var/tmp/portage/app-backup/bareos-21.1.5-r2/work/bareos-Release-21.1.5/core
-- Looking for include file alloca.h
-- Looking for include file alloca.h - found
-- Looking for include file afs/afsint.h
-- Looking for include file afs/afsint.h - not found
-- Looking for include file afs/venus.h
-- Looking for include file afs/venus.h - not found
-- Looking for include file arpa/nameser.h
-- Looking for include file arpa/nameser.h - found
-- Looking for include file attr.h
-- Looking for include file attr.h - not found
-- Looking for include file demangle.h
-- Looking for include file demangle.h - not found
-- Looking for include file execinfo.h
-- Looking for include file execinfo.h - found
-- Looking for include file grp.h
-- Looking for include file grp.h - found
-- Looking for include file libutil.h
-- Looking for include file libutil.h - not found
-- Looking for include file mtio.h
-- Looking for include file mtio.h - not found
-- Looking for include file pwd.h
-- Looking for include file pwd.h - found
-- Looking for include file regex.h
-- Looking for include file regex.h - found
-- Looking for include files sys/types.h, sys/acl.h
-- Looking for include files sys/types.h, sys/acl.h - found
-- Looking for include file sys/attr.h
-- Looking for include file sys/attr.h - not found
-- Looking for include file sys/bitypes.h
-- Looking for include file sys/bitypes.h - found
-- Looking for include file sys/capability.h
-- Looking for include file sys/capability.h - found
-- Looking for include file sys/ea.h
-- Looking for include file sys/ea.h - not found
-- Looking for include files sys/types.h, sys/extattr.h
-- Looking for include files sys/types.h, sys/extattr.h - not found
-- Looking for include file sys/mtio.h
-- Looking for include file sys/mtio.h - found
-- Looking for include file sys/nvpair.h
-- Looking for include file sys/nvpair.h - not found
-- Looking for include files sys/types.h, sys/tape.h
-- Looking for include files sys/types.h, sys/tape.h - not found
-- Looking for include file sys/time.h
-- Looking for include file sys/time.h - found
-- Looking for C++ include cxxabi.h
-- Looking for C++ include cxxabi.h - found
-- Looking for include file curses.h
-- Looking for include file curses.h - found
-- Looking for include file poll.h
-- Looking for include file poll.h - found
-- Looking for include file sys/poll.h
-- Looking for include file sys/poll.h - found
-- Looking for include file sys/statvfs.h
-- Looking for include file sys/statvfs.h - found
-- Looking for include file umem.h
-- Looking for include file umem.h - not found
-- Looking for include file ucontext.h
-- Looking for include file ucontext.h - found
-- Looking for include file sys/proplist.h
-- Looking for include file sys/proplist.h - not found
-- Looking for include file sys/xattr.h
-- Looking for include file sys/xattr.h - found
-- Looking for ceph_statx
-- Looking for ceph_statx - not found
-- Looking for include file rados/librados.h
-- Looking for include file rados/librados.h - not found
-- Looking for include file radosstriper/libradosstriper.h
-- Looking for include file radosstriper/libradosstriper.h - not found
-- Looking for include file glusterfs/api/glfs.h
-- Looking for include file glusterfs/api/glfs.h - not found
-- Looking for include file sys/prctl.h
-- Looking for include file sys/prctl.h - found
-- Looking for include file zlib.h
-- Looking for include file zlib.h - found
-- Looking for include file scsi/scsi.h
-- Looking for include file scsi/scsi.h - found
-- Looking for include files stddef.h, scsi/sg.h
-- Looking for include files stddef.h, scsi/sg.h - found
-- Looking for include files sys/types.h, sys/scsi/impl/uscsi.h
-- Looking for include files sys/types.h, sys/scsi/impl/uscsi.h - not found
-- Looking for include files stdio.h, camlib.h
-- Looking for include files stdio.h, camlib.h - not found
-- Looking for include file cam/scsi/scsi_message.h
-- Looking for include file cam/scsi/scsi_message.h - not found
-- Looking for include file dev/scsipi/scsipi_all.h
-- Looking for include file dev/scsipi/scsipi_all.h - not found
-- Looking for include file scsi/uscsi_all.h
-- Looking for include file scsi/uscsi_all.h - not found
-- Looking for backtrace
-- Looking for backtrace - found
-- Looking for backtrace_symbols
-- Looking for backtrace_symbols - found
-- Looking for fchmod
-- Looking for fchmod - found
-- Looking for fchown
-- Looking for fchown - found
-- Looking for add_proplist_entry
-- Looking for add_proplist_entry - not found
-- Looking for closefrom
-- Looking for closefrom - found
-- Looking for extattr_get_file
-- Looking for extattr_get_file - not found
-- Looking for extattr_get_link
-- Looking for extattr_get_link - not found
-- Looking for extattr_list_file
-- Looking for extattr_list_file - not found
-- Looking for extattr_list_link
-- Looking for extattr_list_link - not found
-- Looking for extattr_namespace_to_string
-- Looking for extattr_namespace_to_string - not found
-- Looking for extattr_set_file
-- Looking for extattr_set_file - not found
-- Looking for extattr_set_link
-- Looking for extattr_set_link - not found
-- Looking for extattr_string_to_namespace
-- Looking for extattr_string_to_namespace - not found
-- Looking for fchownat
-- Looking for fchownat - found
-- Looking for fdatasync
-- Looking for fdatasync - found
-- Looking for fseeko
-- Looking for fseeko - found
-- Looking for futimens
-- Looking for futimens - found
-- Looking for futimes
-- Looking for futimes - found
-- Looking for futimesat
-- Looking for futimesat - found
-- Looking for getaddrinfo
-- Looking for getaddrinfo - found
-- Looking for getea
-- Looking for getea - not found
-- Looking for gethostbyname2
-- Looking for gethostbyname2 - found
-- Looking for getmntent
-- Looking for getmntent - found
-- Looking for getmntinfo
-- Looking for getmntinfo - not found
-- Looking for getpagesize
-- Looking for getpagesize - found
-- Looking for getproplist
-- Looking for getproplist - not found
-- Looking for getxattr
-- Looking for getxattr - found
-- Looking for get_proplist_entry
-- Looking for get_proplist_entry - not found
-- Looking for glfs_readdirplus
-- Looking for glfs_readdirplus - not found
-- Looking for glob
-- Looking for glob - found
-- Looking for inet_ntop
-- Looking for inet_ntop - found
-- Looking for lchmod
-- Looking for lchmod - found
-- Looking for lchown
-- Looking for lchown - found
-- Looking for lgetea
-- Looking for lgetea - not found
-- Looking for lgetxattr
-- Looking for lgetxattr - found
-- Looking for listea
-- Looking for listea - not found
-- Looking for listxattr
-- Looking for listxattr - found
-- Looking for llistea
-- Looking for llistea - not found
-- Looking for llistxattr
-- Looking for llistxattr - found
-- Looking for localtime_r
-- Looking for localtime_r - found
-- Looking for lsetea
-- Looking for lsetea - not found
-- Looking for lsetxattr
-- Looking for lsetxattr - found
-- Looking for lutimes
-- Looking for lutimes - found
-- Looking for nanosleep
-- Looking for nanosleep - found
-- Looking for openat
-- Looking for openat - found
-- Looking for poll
-- Looking for poll - found
-- Looking for posix_fadvise
-- Looking for posix_fadvise - found
-- Looking for prctl
-- Looking for prctl - found
-- Looking for readdir_r
-- Looking for readdir_r - found
-- Looking for setea
-- Looking for setea - not found
-- Looking for setproplist
-- Looking for setproplist - not found
-- Looking for setreuid
-- Looking for setreuid - found
-- Looking for setxattr
-- Looking for setxattr - found
-- Looking for hl_loa
-- Looking for hl_loa - not found
-- Looking for sizeof_proplist_entry
-- Looking for sizeof_proplist_entry - not found
-- Looking for unlinkat
-- Looking for unlinkat - found
-- Looking for utimes
-- Looking for utimes - found
-- Looking for chflags
-- Looking for chflags - found
-- Looking for __stub_lchmod
-- Looking for __stub_lchmod - not found
-- Looking for __stub___lchmod
-- Looking for __stub___lchmod - not found
-- Looking for __stub_chflags
-- Looking for __stub_chflags - found
-- lchflags is a stub, setting HAVE_CHFLAGS to 0
-- Looking for rados_ioctx_set_namespace
-- Looking for rados_ioctx_set_namespace - not found
-- Looking for rados_nobjects_list_open
-- Looking for rados_nobjects_list_open - not found
-- Performing Test HAVE_ACL_TYPE_DEFAULT_DIR
-- Performing Test HAVE_ACL_TYPE_DEFAULT_DIR - Failed
-- Performing Test HAVE_ACL_TYPE_EXTENDED
-- Performing Test HAVE_ACL_TYPE_EXTENDED - Failed
-- Performing Test HAVE_ACL_TYPE_NFS4
-- Performing Test HAVE_ACL_TYPE_NFS4 - Failed
-- CMAKE_BINARY_DIR:         /var/tmp/portage/app-backup/bareos-21.1.5-r2/work/bareos-21.1.5_build
-- CMAKE_CURRENT_BINARY_DIR: /var/tmp/portage/app-backup/bareos-21.1.5-r2/work/bareos-21.1.5_build/core
-- PROJECT_SOURCE_DIR:         /var/tmp/portage/app-backup/bareos-21.1.5-r2/work/bareos-Release-21.1.5/core
-- CMAKE_CURRENT_SOURCE_DIR: /var/tmp/portage/app-backup/bareos-21.1.5-r2/work/bareos-Release-21.1.5/core
-- PROJECT_BINARY_DIR: /var/tmp/portage/app-backup/bareos-21.1.5-r2/work/bareos-21.1.5_build/core
-- PROJECT_SOURCE_DIR: /var/tmp/portage/app-backup/bareos-21.1.5-r2/work/bareos-Release-21.1.5/core
-- EXECUTABLE_OUTPUT_PATH: 
-- LIBRARY_OUTPUT_PATH:     
-- CMAKE_MODULE_PATH: /var/tmp/portage/app-backup/bareos-21.1.5-r2/work/bareos-Release-21.1.5/cmake/var/tmp/portage/app-backup/bareos-21.1.5-r2/work/bareos-Release-21.1.5/core/cmake/var/tmp/portage/app-backup/bareos-21.1.5-r2/work/bareos-Release-21.1.5/core/../../SOURCES/var/tmp/portage/app-backup/bareos-21.1.5-r2/work/bareos-Release-21.1.5/core/../SOURCES/var/tmp/portage/app-backup/bareos-21.1.5-r2/work/bareos-Release-21.1.5/core/cmake
-- CMAKE_COMMAND: /usr/bin/cmake
-- CMAKE_VERSION: 3.25.2
-- CMAKE_ROOT: /usr/share/cmake
-- CMAKE_CURRENT_LIST_FILE: /var/tmp/portage/app-backup/bareos-21.1.5-r2/work/bareos-Release-21.1.5/core/CMakeLists.txt
-- CMAKE_CURRENT_LIST_LINE: 508
-- CMAKE_INCLUDE_PATH: 
-- CMAKE_LIBRARY_PATH: 
-- CMAKE_SYSTEM: Linux-5.15.85-gentoo-dist
-- CMAKE_SYSTEM_NAME: Linux
-- CMAKE_SYSTEM_VERSION: 5.15.85-gentoo-dist
-- CMAKE_SYSTEM_PROCESSOR: x86_64
-- UNIX: 1
-- WIN32: 
-- APPLE: 
-- MINGW: 
-- CYGWIN: 
-- BORLAND: 
-- MSVC: 
-- MSVC_IDE: 
-- MSVC60: 
-- MSVC70: 
-- MSVC71: 
-- MSVC80: 
-- CMAKE_COMPILER_2005: 
-- CMAKE_SKIP_RULE_DEPENDENCY: 
-- CMAKE_SKIP_INSTALL_ALL_DEPENDENCY: 
-- CMAKE_SKIP_RPATH: NO
-- CMAKE_VERBOSE_MAKEFILE: FALSE
-- CMAKE_SUPPRESS_REGENERATION: 
-- CMAKE_BUILD_TYPE: Gentoo
-- BUILD_SHARED_LIBS: ON
-- CMAKE_C_COMPILER:           /usr/bin/x86_64-pc-linux-gnu-gcc
-- CMAKE_C_FLAGS:              -O2 -march=x86-64 -pipe -pipe -frecord-gcc-switches -fno-diagnostics-color -fmessage-length=0 -fdebug-prefix-map=/var/tmp/portage/app-backup/bareos-21.1.5-r2/work/bareos-Release-21.1.5/core=. -fmacro-prefix-map=/var/tmp/portage/app-backup/bareos-21.1.5-r2/work/bareos-Release-21.1.5/core=. -Wall
-- CMAKE_C_COMPILER_ID:        GNU
-- CMAKE_C_COMPILER_VERSION:   13.0.1
-- CMAKE_CXX_COMPILER:         /usr/bin/x86_64-pc-linux-gnu-g++
-- CMAKE_CXX_FLAGS:            -O2 -march=x86-64 -pipe -pipe -frecord-gcc-switches -fno-diagnostics-color -fmessage-length=0 -Wsuggest-override -Wformat -Wformat-security -fdebug-prefix-map=/var/tmp/portage/app-backup/bareos-21.1.5-r2/work/bareos-Release-21.1.5/core=. -fmacro-prefix-map=/var/tmp/portage/app-backup/bareos-21.1.5-r2/work/bareos-Release-21.1.5/core=. -Wno-unknown-pragmas -Wall
-- CMAKE_CXX_COMPILER_ID:      GNU
-- CMAKE_CXX_COMPILER_VERSION: 13.0.1
-- CMAKE_AR: /usr/bin/x86_64-pc-linux-gnu-ar
-- CMAKE_RANLIB: /usr/bin/x86_64-pc-linux-gnu-ranlib
-- CMAKE_INSTALL_PREFIX:         /usr
-- acl found, libs: /usr/lib64/libacl.so
-- installing /var/log/bareos
-- installing 
-- creating file /var/tmp/portage/app-backup/bareos-21.1.5-r2/work/bareos-Release-21.1.5/core/platforms/aix/bareos-fd
-- creating file /var/tmp/portage/app-backup/bareos-21.1.5-r2/work/bareos-Release-21.1.5/core/platforms/darwin/resources/ReadMe.html
-- creating file /var/tmp/portage/app-backup/bareos-21.1.5-r2/work/bareos-Release-21.1.5/core/platforms/darwin/resources/com.bareos.bareos-fd.plist
-- creating file /var/tmp/portage/app-backup/bareos-21.1.5-r2/work/bareos-Release-21.1.5/core/platforms/darwin/resources/postinstall
-- creating file /var/tmp/portage/app-backup/bareos-21.1.5-r2/work/bareos-Release-21.1.5/core/platforms/darwin/resources/preinstall
-- creating file /var/tmp/portage/app-backup/bareos-21.1.5-r2/work/bareos-Release-21.1.5/core/platforms/darwin/resources/uninstall-bareos
-- creating file /var/tmp/portage/app-backup/bareos-21.1.5-r2/work/bareos-Release-21.1.5/core/platforms/darwin/resources/welcome.txt
-- creating file /var/tmp/portage/app-backup/bareos-21.1.5-r2/work/bareos-Release-21.1.5/core/platforms/debian/set_dbconfig_vars.sh
-- creating file /var/tmp/portage/app-backup/bareos-21.1.5-r2/work/bareos-Release-21.1.5/core/platforms/freebsd/bareos-dir
-- creating file /var/tmp/portage/app-backup/bareos-21.1.5-r2/work/bareos-Release-21.1.5/core/platforms/freebsd/bareos-fd
-- creating file /var/tmp/portage/app-backup/bareos-21.1.5-r2/work/bareos-Release-21.1.5/core/platforms/freebsd/bareos-sd
-- creating file /var/tmp/portage/app-backup/bareos-21.1.5-r2/work/bareos-Release-21.1.5/core/platforms/hurd/bareos-dir
-- creating file /var/tmp/portage/app-backup/bareos-21.1.5-r2/work/bareos-Release-21.1.5/core/platforms/hurd/bareos-fd
-- creating file /var/tmp/portage/app-backup/bareos-21.1.5-r2/work/bareos-Release-21.1.5/core/platforms/hurd/bareos-sd
-- creating file /var/tmp/portage/app-backup/bareos-21.1.5-r2/work/bareos-Release-21.1.5/core/platforms/openbsd/bareos-dir
-- creating file /var/tmp/portage/app-backup/bareos-21.1.5-r2/work/bareos-Release-21.1.5/core/platforms/openbsd/bareos-fd
-- creating file /var/tmp/portage/app-backup/bareos-21.1.5-r2/work/bareos-Release-21.1.5/core/platforms/openbsd/bareos-sd
-- creating file /var/tmp/portage/app-backup/bareos-21.1.5-r2/work/bareos-Release-21.1.5/core/platforms/redhat/bareos-dir
-- creating file /var/tmp/portage/app-backup/bareos-21.1.5-r2/work/bareos-Release-21.1.5/core/platforms/redhat/bareos-fd
-- creating file /var/tmp/portage/app-backup/bareos-21.1.5-r2/work/bareos-Release-21.1.5/core/platforms/redhat/bareos-sd
-- creating file /var/tmp/portage/app-backup/bareos-21.1.5-r2/work/bareos-Release-21.1.5/core/platforms/slackware/functions.bareos
-- creating file /var/tmp/portage/app-backup/bareos-21.1.5-r2/work/bareos-Release-21.1.5/core/platforms/slackware/rc.bareos-dir
-- creating file /var/tmp/portage/app-backup/bareos-21.1.5-r2/work/bareos-Release-21.1.5/core/platforms/slackware/rc.bareos-fd
-- creating file /var/tmp/portage/app-backup/bareos-21.1.5-r2/work/bareos-Release-21.1.5/core/platforms/slackware/rc.bareos-sd
-- creating file /var/tmp/portage/app-backup/bareos-21.1.5-r2/work/bareos-Release-21.1.5/core/platforms/solaris/bareos-dir
-- creating file /var/tmp/portage/app-backup/bareos-21.1.5-r2/work/bareos-Release-21.1.5/core/platforms/solaris/bareos-fd
-- creating file /var/tmp/portage/app-backup/bareos-21.1.5-r2/work/bareos-Release-21.1.5/core/platforms/solaris/bareos-sd
-- creating file /var/tmp/portage/app-backup/bareos-21.1.5-r2/work/bareos-Release-21.1.5/core/platforms/suse/bareos-dir
-- creating file /var/tmp/portage/app-backup/bareos-21.1.5-r2/work/bareos-Release-21.1.5/core/platforms/suse/bareos-fd
-- creating file /var/tmp/portage/app-backup/bareos-21.1.5-r2/work/bareos-Release-21.1.5/core/platforms/suse/bareos-sd
-- creating file /var/tmp/portage/app-backup/bareos-21.1.5-r2/work/bareos-Release-21.1.5/core/platforms/systemd/bareos-dir.service
-- creating file /var/tmp/portage/app-backup/bareos-21.1.5-r2/work/bareos-Release-21.1.5/core/platforms/systemd/bareos-fd.service
-- creating file /var/tmp/portage/app-backup/bareos-21.1.5-r2/work/bareos-Release-21.1.5/core/platforms/systemd/bareos-sd.service
-- creating file /var/tmp/portage/app-backup/bareos-21.1.5-r2/work/bareos-Release-21.1.5/core/platforms/univention/AppCenter/univention-bareos.ini
-- creating file /var/tmp/portage/app-backup/bareos-21.1.5-r2/work/bareos-Release-21.1.5/core/platforms/univention/conffiles/etc/apt/sources.list.d/60_bareos.list
-- creating file /var/tmp/portage/app-backup/bareos-21.1.5-r2/work/bareos-Release-21.1.5/core/scripts/bareos-config-lib.sh
-- creating file /var/tmp/portage/app-backup/bareos-21.1.5-r2/work/bareos-Release-21.1.5/core/scripts/bareos-config
-- creating file /var/tmp/portage/app-backup/bareos-21.1.5-r2/work/bareos-Release-21.1.5/core/scripts/bareos-ctl-dir
-- creating file /var/tmp/portage/app-backup/bareos-21.1.5-r2/work/bareos-Release-21.1.5/core/scripts/bareos-ctl-fd
-- creating file /var/tmp/portage/app-backup/bareos-21.1.5-r2/work/bareos-Release-21.1.5/core/scripts/bareos-ctl-sd
-- creating file /var/tmp/portage/app-backup/bareos-21.1.5-r2/work/bareos-Release-21.1.5/core/scripts/bareos-explorer
-- creating file /var/tmp/portage/app-backup/bareos-21.1.5-r2/work/bareos-Release-21.1.5/core/scripts/bareos-glusterfind-wrapper
-- creating file /var/tmp/portage/app-backup/bareos-21.1.5-r2/work/bareos-Release-21.1.5/core/scripts/bareos
-- creating file /var/tmp/portage/app-backup/bareos-21.1.5-r2/work/bareos-Release-21.1.5/core/scripts/bconsole
-- creating file /var/tmp/portage/app-backup/bareos-21.1.5-r2/work/bareos-Release-21.1.5/core/scripts/btraceback
-- creating file /var/tmp/portage/app-backup/bareos-21.1.5-r2/work/bareos-Release-21.1.5/core/scripts/disk-changer
-- creating file /var/tmp/portage/app-backup/bareos-21.1.5-r2/work/bareos-Release-21.1.5/core/scripts/logrotate
-- creating file /var/tmp/portage/app-backup/bareos-21.1.5-r2/work/bareos-Release-21.1.5/core/scripts/logwatch/logfile.bareos.conf
-- creating file /var/tmp/portage/app-backup/bareos-21.1.5-r2/work/bareos-Release-21.1.5/core/scripts/mtx-changer
-- creating file /var/tmp/portage/app-backup/bareos-21.1.5-r2/work/bareos-Release-21.1.5/core/src/cats/create_bareos_database
-- creating file /var/tmp/portage/app-backup/bareos-21.1.5-r2/work/bareos-Release-21.1.5/core/src/cats/ddl/versions.map
-- creating file /var/tmp/portage/app-backup/bareos-21.1.5-r2/work/bareos-Release-21.1.5/core/src/cats/delete_catalog_backup
-- creating file /var/tmp/portage/app-backup/bareos-21.1.5-r2/work/bareos-Release-21.1.5/core/src/cats/drop_bareos_database
-- creating file /var/tmp/portage/app-backup/bareos-21.1.5-r2/work/bareos-Release-21.1.5/core/src/cats/drop_bareos_tables
-- creating file /var/tmp/portage/app-backup/bareos-21.1.5-r2/work/bareos-Release-21.1.5/core/src/cats/grant_bareos_privileges
-- creating file /var/tmp/portage/app-backup/bareos-21.1.5-r2/work/bareos-Release-21.1.5/core/src/cats/install-default-backend
-- creating file /var/tmp/portage/app-backup/bareos-21.1.5-r2/work/bareos-Release-21.1.5/core/src/cats/make_bareos_tables
-- creating file /var/tmp/portage/app-backup/bareos-21.1.5-r2/work/bareos-Release-21.1.5/core/src/cats/make_catalog_backup
-- creating file /var/tmp/portage/app-backup/bareos-21.1.5-r2/work/bareos-Release-21.1.5/core/src/cats/make_catalog_backup.pl
-- creating file /var/tmp/portage/app-backup/bareos-21.1.5-r2/work/bareos-Release-21.1.5/core/src/cats/update_bareos_tables
-- creating file /var/tmp/portage/app-backup/bareos-21.1.5-r2/work/bareos-Release-21.1.5/core/src/console/bconsole.conf
-- creating file /var/tmp/portage/app-backup/bareos-21.1.5-r2/work/bareos-Release-21.1.5/core/src/defaultconfigs/bareos-dir.d/catalog/MyCatalog.conf
-- creating file /var/tmp/portage/app-backup/bareos-21.1.5-r2/work/bareos-Release-21.1.5/core/src/defaultconfigs/bareos-dir.d/client/bareos-fd.conf
-- creating file /var/tmp/portage/app-backup/bareos-21.1.5-r2/work/bareos-Release-21.1.5/core/src/defaultconfigs/bareos-dir.d/console/bareos-mon.conf
-- creating file /var/tmp/portage/app-backup/bareos-21.1.5-r2/work/bareos-Release-21.1.5/core/src/defaultconfigs/bareos-dir.d/director/bareos-dir.conf
-- creating file /var/tmp/portage/app-backup/bareos-21.1.5-r2/work/bareos-Release-21.1.5/core/src/defaultconfigs/bareos-dir.d/fileset/Catalog.conf
-- creating file /var/tmp/portage/app-backup/bareos-21.1.5-r2/work/bareos-Release-21.1.5/core/src/defaultconfigs/bareos-dir.d/fileset/LinuxAll.conf
-- creating file /var/tmp/portage/app-backup/bareos-21.1.5-r2/work/bareos-Release-21.1.5/core/src/defaultconfigs/bareos-dir.d/fileset/SelfTest.conf
-- creating file /var/tmp/portage/app-backup/bareos-21.1.5-r2/work/bareos-Release-21.1.5/core/src/defaultconfigs/bareos-dir.d/job/BackupCatalog.conf
-- creating file /var/tmp/portage/app-backup/bareos-21.1.5-r2/work/bareos-Release-21.1.5/core/src/defaultconfigs/bareos-dir.d/job/RestoreFiles.conf
-- creating file /var/tmp/portage/app-backup/bareos-21.1.5-r2/work/bareos-Release-21.1.5/core/src/defaultconfigs/bareos-dir.d/job/backup-bareos-fd.conf
-- creating file /var/tmp/portage/app-backup/bareos-21.1.5-r2/work/bareos-Release-21.1.5/core/src/defaultconfigs/bareos-dir.d/jobdefs/DefaultJob.conf
-- creating file /var/tmp/portage/app-backup/bareos-21.1.5-r2/work/bareos-Release-21.1.5/core/src/defaultconfigs/bareos-dir.d/messages/Daemon.conf
-- creating file /var/tmp/portage/app-backup/bareos-21.1.5-r2/work/bareos-Release-21.1.5/core/src/defaultconfigs/bareos-dir.d/messages/Standard.conf
-- creating file /var/tmp/portage/app-backup/bareos-21.1.5-r2/work/bareos-Release-21.1.5/core/src/defaultconfigs/bareos-dir.d/storage/File.conf
-- creating file /var/tmp/portage/app-backup/bareos-21.1.5-r2/work/bareos-Release-21.1.5/core/src/defaultconfigs/bareos-fd.d/client/myself.conf
-- creating file /var/tmp/portage/app-backup/bareos-21.1.5-r2/work/bareos-Release-21.1.5/core/src/defaultconfigs/bareos-fd.d/director/bareos-dir.conf
-- creating file /var/tmp/portage/app-backup/bareos-21.1.5-r2/work/bareos-Release-21.1.5/core/src/defaultconfigs/bareos-fd.d/director/bareos-mon.conf
-- creating file /var/tmp/portage/app-backup/bareos-21.1.5-r2/work/bareos-Release-21.1.5/core/src/defaultconfigs/bareos-sd.d/device/FileStorage.conf
-- creating file /var/tmp/portage/app-backup/bareos-21.1.5-r2/work/bareos-Release-21.1.5/core/src/defaultconfigs/bareos-sd.d/director/bareos-dir.conf
-- creating file /var/tmp/portage/app-backup/bareos-21.1.5-r2/work/bareos-Release-21.1.5/core/src/defaultconfigs/bareos-sd.d/director/bareos-mon.conf
-- creating file /var/tmp/portage/app-backup/bareos-21.1.5-r2/work/bareos-Release-21.1.5/core/src/defaultconfigs/bareos-sd.d/storage/bareos-sd.conf
-- creating file /var/tmp/portage/app-backup/bareos-21.1.5-r2/work/bareos-Release-21.1.5/core/src/defaultconfigs/tray-monitor.d/client/FileDaemon-local.conf
-- creating file /var/tmp/portage/app-backup/bareos-21.1.5-r2/work/bareos-Release-21.1.5/core/src/defaultconfigs/tray-monitor.d/director/Director-local.conf
-- creating file /var/tmp/portage/app-backup/bareos-21.1.5-r2/work/bareos-Release-21.1.5/core/src/defaultconfigs/tray-monitor.d/monitor/bareos-mon.conf
-- creating file /var/tmp/portage/app-backup/bareos-21.1.5-r2/work/bareos-Release-21.1.5/core/src/defaultconfigs/tray-monitor.d/storage/StorageDaemon-local.conf
-- creating file /var/tmp/portage/app-backup/bareos-21.1.5-r2/work/bareos-Release-21.1.5/core/src/droplet/droplet-3.0.pc
-- creating file /var/tmp/portage/app-backup/bareos-21.1.5-r2/work/bareos-Release-21.1.5/core/src/droplet/libdroplet.spec
-- creating file /var/tmp/portage/app-backup/bareos-21.1.5-r2/work/bareos-Release-21.1.5/core/src/include/config.h
-- creating file /var/tmp/portage/app-backup/bareos-21.1.5-r2/work/bareos-Release-21.1.5/core/src/plugins/filed/python/ldap/python-ldap-conf.d/bareos-dir.d/fileset/plugin-ldap.conf.example
-- creating file /var/tmp/portage/app-backup/bareos-21.1.5-r2/work/bareos-Release-21.1.5/core/src/plugins/filed/python/ovirt/python-ovirt-conf.d/bareos-dir.d/fileset/plugin-ovirt.conf.example
-- creating file /var/tmp/portage/app-backup/bareos-21.1.5-r2/work/bareos-Release-21.1.5/core/src/qt-tray-monitor/bareos-tray-monitor.desktop
-- creating file /var/tmp/portage/app-backup/bareos-21.1.5-r2/work/bareos-Release-21.1.5/core/src/tests/configs/bareos-configparser-tests/bareos-dir-CFG_TYPE_STR_VECTOR_OF_DIRS.conf
-- creating file /var/tmp/portage/app-backup/bareos-21.1.5-r2/work/bareos-Release-21.1.5/core/src/tests/configs/catalog/bareos-dir.d/catalog/MyCatalog.conf
-- creating file /var/tmp/portage/app-backup/bareos-21.1.5-r2/work/bareos-Release-21.1.5/core/src/tests/configs/console-director/tls_disabled/bareos-dir.d/director/bareos-dir.conf
-- creating file /var/tmp/portage/app-backup/bareos-21.1.5-r2/work/bareos-Release-21.1.5/core/src/tests/configs/console-director/tls_disabled/bareos-dir.d/fileset/Catalog.conf
-- creating file /var/tmp/portage/app-backup/bareos-21.1.5-r2/work/bareos-Release-21.1.5/core/src/tests/configs/console-director/tls_disabled/bareos-dir.d/fileset/LinuxAll.conf
-- creating file /var/tmp/portage/app-backup/bareos-21.1.5-r2/work/bareos-Release-21.1.5/core/src/tests/configs/console-director/tls_disabled/bareos-dir.d/fileset/SelfTest.conf
-- creating file /var/tmp/portage/app-backup/bareos-21.1.5-r2/work/bareos-Release-21.1.5/core/src/tests/configs/console-director/tls_disabled/bareos-dir.d/job/BackupCatalog.conf
-- creating file /var/tmp/portage/app-backup/bareos-21.1.5-r2/work/bareos-Release-21.1.5/core/src/tests/configs/console-director/tls_disabled/bareos-dir.d/jobdefs/DefaultJob.conf
-- creating file /var/tmp/portage/app-backup/bareos-21.1.5-r2/work/bareos-Release-21.1.5/core/src/tests/configs/console-director/tls_disabled/bareos-dir.d/messages/Daemon.conf
-- creating file /var/tmp/portage/app-backup/bareos-21.1.5-r2/work/bareos-Release-21.1.5/core/src/tests/configs/console-director/tls_disabled/bareos-dir.d/messages/Standard.conf
-- creating file /var/tmp/portage/app-backup/bareos-21.1.5-r2/work/bareos-Release-21.1.5/core/src/tests/configs/console-director/tls_psk_default_enabled/bareos-dir.d/director/bareos-dir.conf
-- creating file /var/tmp/portage/app-backup/bareos-21.1.5-r2/work/bareos-Release-21.1.5/core/src/tests/configs/console-director/tls_psk_default_enabled/bareos-dir.d/fileset/Catalog.conf
-- creating file /var/tmp/portage/app-backup/bareos-21.1.5-r2/work/bareos-Release-21.1.5/core/src/tests/configs/console-director/tls_psk_default_enabled/bareos-dir.d/fileset/LinuxAll.conf
-- creating file /var/tmp/portage/app-backup/bareos-21.1.5-r2/work/bareos-Release-21.1.5/core/src/tests/configs/console-director/tls_psk_default_enabled/bareos-dir.d/fileset/SelfTest.conf
-- creating file /var/tmp/portage/app-backup/bareos-21.1.5-r2/work/bareos-Release-21.1.5/core/src/tests/configs/console-director/tls_psk_default_enabled/bareos-dir.d/job/BackupCatalog.conf
-- creating file /var/tmp/portage/app-backup/bareos-21.1.5-r2/work/bareos-Release-21.1.5/core/src/tests/configs/console-director/tls_psk_default_enabled/bareos-dir.d/jobdefs/DefaultJob.conf
-- creating file /var/tmp/portage/app-backup/bareos-21.1.5-r2/work/bareos-Release-21.1.5/core/src/tests/configs/console-director/tls_psk_default_enabled/bareos-dir.d/messages/Daemon.conf
-- creating file /var/tmp/portage/app-backup/bareos-21.1.5-r2/work/bareos-Release-21.1.5/core/src/tests/configs/console-director/tls_psk_default_enabled/bareos-dir.d/messages/Standard.conf
-- creating file /var/tmp/portage/app-backup/bareos-21.1.5-r2/work/bareos-Release-21.1.5/core/src/tests/configs/sd_backend/bareos-sd.d/device/droplet.conf
-- creating file /var/tmp/portage/app-backup/bareos-21.1.5-r2/work/bareos-Release-21.1.5/core/src/tests/configs/sd_backend/bareos-sd.d/storage/myself.conf
-- creating file /var/tmp/portage/app-backup/bareos-21.1.5-r2/work/bareos-Release-21.1.5/core/src/tests/configs/sd_backend/droplet.profile
-- creating file /var/tmp/portage/app-backup/bareos-21.1.5-r2/work/bareos-Release-21.1.5/core/src/tests/configs/sd_reservation/bareos-sd.d/storage/myself.conf
-- creating file /var/tmp/portage/app-backup/bareos-21.1.5-r2/work/bareos-Release-21.1.5/core/src/win32/console/consoleres.rc
-- creating file /var/tmp/portage/app-backup/bareos-21.1.5-r2/work/bareos-Release-21.1.5/core/src/win32/dird/dbcheckres.rc
-- creating file /var/tmp/portage/app-backup/bareos-21.1.5-r2/work/bareos-Release-21.1.5/core/src/win32/dird/dirdres.rc
-- creating file /var/tmp/portage/app-backup/bareos-21.1.5-r2/work/bareos-Release-21.1.5/core/src/win32/filed/filedres.rc
-- creating file /var/tmp/portage/app-backup/bareos-21.1.5-r2/work/bareos-Release-21.1.5/core/src/win32/qt-tray-monitor/traymon.rc
-- creating file /var/tmp/portage/app-backup/bareos-21.1.5-r2/work/bareos-Release-21.1.5/core/src/win32/stored/bextractres.rc
-- creating file /var/tmp/portage/app-backup/bareos-21.1.5-r2/work/bareos-Release-21.1.5/core/src/win32/stored/blsres.rc
-- creating file /var/tmp/portage/app-backup/bareos-21.1.5-r2/work/bareos-Release-21.1.5/core/src/win32/stored/bscanres.rc
-- creating file /var/tmp/portage/app-backup/bareos-21.1.5-r2/work/bareos-Release-21.1.5/core/src/win32/stored/btaperes.rc
-- creating file /var/tmp/portage/app-backup/bareos-21.1.5-r2/work/bareos-Release-21.1.5/core/src/win32/stored/storedres.rc
-- creating file /var/tmp/portage/app-backup/bareos-21.1.5-r2/work/bareos-Release-21.1.5/core/src/win32/tools/bregexres.rc
-- creating file /var/tmp/portage/app-backup/bareos-21.1.5-r2/work/bareos-Release-21.1.5/core/src/win32/tools/bsmtpres.rc
-- creating file /var/tmp/portage/app-backup/bareos-21.1.5-r2/work/bareos-Release-21.1.5/core/src/win32/tools/bwildres.rc
-- creating file /var/tmp/portage/app-backup/bareos-21.1.5-r2/work/bareos-Release-21.1.5/debian/bareos-bconsole.install
-- creating file /var/tmp/portage/app-backup/bareos-21.1.5-r2/work/bareos-Release-21.1.5/debian/bareos-bconsole.postinst
-- creating file /var/tmp/portage/app-backup/bareos-21.1.5-r2/work/bareos-Release-21.1.5/debian/bareos-common.install
-- creating file /var/tmp/portage/app-backup/bareos-21.1.5-r2/work/bareos-Release-21.1.5/debian/bareos-common.postinst
-- creating file /var/tmp/portage/app-backup/bareos-21.1.5-r2/work/bareos-Release-21.1.5/debian/bareos-common.preinst
-- creating file /var/tmp/portage/app-backup/bareos-21.1.5-r2/work/bareos-Release-21.1.5/debian/bareos-database-common.config
-- creating file /var/tmp/portage/app-backup/bareos-21.1.5-r2/work/bareos-Release-21.1.5/debian/bareos-database-common.install
-- creating file /var/tmp/portage/app-backup/bareos-21.1.5-r2/work/bareos-Release-21.1.5/debian/bareos-database-common.postinst
-- creating file /var/tmp/portage/app-backup/bareos-21.1.5-r2/work/bareos-Release-21.1.5/debian/bareos-database-postgresql.dirs
-- creating file /var/tmp/portage/app-backup/bareos-21.1.5-r2/work/bareos-Release-21.1.5/debian/bareos-database-postgresql.install
-- creating file /var/tmp/portage/app-backup/bareos-21.1.5-r2/work/bareos-Release-21.1.5/debian/bareos-database-tools.install
-- creating file /var/tmp/portage/app-backup/bareos-21.1.5-r2/work/bareos-Release-21.1.5/debian/bareos-database-tools.postinst
-- creating file /var/tmp/portage/app-backup/bareos-21.1.5-r2/work/bareos-Release-21.1.5/debian/bareos-director-python-plugins-common.install
-- creating file /var/tmp/portage/app-backup/bareos-21.1.5-r2/work/bareos-Release-21.1.5/debian/bareos-director-python2-plugin.install
-- creating file /var/tmp/portage/app-backup/bareos-21.1.5-r2/work/bareos-Release-21.1.5/debian/bareos-director-python3-plugin.install
-- creating file /var/tmp/portage/app-backup/bareos-21.1.5-r2/work/bareos-Release-21.1.5/debian/bareos-director.install
-- creating file /var/tmp/portage/app-backup/bareos-21.1.5-r2/work/bareos-Release-21.1.5/debian/bareos-director.postinst
-- creating file /var/tmp/portage/app-backup/bareos-21.1.5-r2/work/bareos-Release-21.1.5/debian/bareos-director.preinst
-- creating file /var/tmp/portage/app-backup/bareos-21.1.5-r2/work/bareos-Release-21.1.5/debian/bareos-director.service
-- creating file /var/tmp/portage/app-backup/bareos-21.1.5-r2/work/bareos-Release-21.1.5/debian/bareos-filedaemon-ceph-plugin.install
-- creating file /var/tmp/portage/app-backup/bareos-21.1.5-r2/work/bareos-Release-21.1.5/debian/bareos-filedaemon-glusterfs-plugin.install
-- creating file /var/tmp/portage/app-backup/bareos-21.1.5-r2/work/bareos-Release-21.1.5/debian/bareos-filedaemon-ldap-python-plugin.install
-- creating file /var/tmp/portage/app-backup/bareos-21.1.5-r2/work/bareos-Release-21.1.5/debian/bareos-filedaemon-libcloud-python-plugin.install
-- creating file /var/tmp/portage/app-backup/bareos-21.1.5-r2/work/bareos-Release-21.1.5/debian/bareos-filedaemon-mariabackup-python-plugin.install
-- creating file /var/tmp/portage/app-backup/bareos-21.1.5-r2/work/bareos-Release-21.1.5/debian/bareos-filedaemon-percona-xtrabackup-python-plugin.install
-- creating file /var/tmp/portage/app-backup/bareos-21.1.5-r2/work/bareos-Release-21.1.5/debian/bareos-filedaemon-postgresql-python-plugin.install
-- creating file /var/tmp/portage/app-backup/bareos-21.1.5-r2/work/bareos-Release-21.1.5/debian/bareos-filedaemon-python-plugins-common.install
-- creating file /var/tmp/portage/app-backup/bareos-21.1.5-r2/work/bareos-Release-21.1.5/debian/bareos-filedaemon-python2-plugin.install
-- creating file /var/tmp/portage/app-backup/bareos-21.1.5-r2/work/bareos-Release-21.1.5/debian/bareos-filedaemon-python3-plugin.install
-- creating file /var/tmp/portage/app-backup/bareos-21.1.5-r2/work/bareos-Release-21.1.5/debian/bareos-filedaemon.install
-- creating file /var/tmp/portage/app-backup/bareos-21.1.5-r2/work/bareos-Release-21.1.5/debian/bareos-filedaemon.postinst
-- creating file /var/tmp/portage/app-backup/bareos-21.1.5-r2/work/bareos-Release-21.1.5/debian/bareos-filedaemon.preinst
-- creating file /var/tmp/portage/app-backup/bareos-21.1.5-r2/work/bareos-Release-21.1.5/debian/bareos-filedaemon.service
-- creating file /var/tmp/portage/app-backup/bareos-21.1.5-r2/work/bareos-Release-21.1.5/debian/bareos-storage-ceph.install
-- creating file /var/tmp/portage/app-backup/bareos-21.1.5-r2/work/bareos-Release-21.1.5/debian/bareos-storage-droplet.install
-- creating file /var/tmp/portage/app-backup/bareos-21.1.5-r2/work/bareos-Release-21.1.5/debian/bareos-storage-fifo.install
-- creating file /var/tmp/portage/app-backup/bareos-21.1.5-r2/work/bareos-Release-21.1.5/debian/bareos-storage-glusterfs.install
-- creating file /var/tmp/portage/app-backup/bareos-21.1.5-r2/work/bareos-Release-21.1.5/debian/bareos-storage-python-plugins-common.install
-- creating file /var/tmp/portage/app-backup/bareos-21.1.5-r2/work/bareos-Release-21.1.5/debian/bareos-storage-python2-plugin.install
-- creating file /var/tmp/portage/app-backup/bareos-21.1.5-r2/work/bareos-Release-21.1.5/debian/bareos-storage-python3-plugin.install
-- creating file /var/tmp/portage/app-backup/bareos-21.1.5-r2/work/bareos-Release-21.1.5/debian/bareos-storage-tape.install
-- creating file /var/tmp/portage/app-backup/bareos-21.1.5-r2/work/bareos-Release-21.1.5/debian/bareos-storage-tape.postinst
-- creating file /var/tmp/portage/app-backup/bareos-21.1.5-r2/work/bareos-Release-21.1.5/debian/bareos-storage.install
-- creating file /var/tmp/portage/app-backup/bareos-21.1.5-r2/work/bareos-Release-21.1.5/debian/bareos-storage.postinst
-- creating file /var/tmp/portage/app-backup/bareos-21.1.5-r2/work/bareos-Release-21.1.5/debian/bareos-storage.preinst
-- creating file /var/tmp/portage/app-backup/bareos-21.1.5-r2/work/bareos-Release-21.1.5/debian/bareos-storage.service
-- creating file /var/tmp/portage/app-backup/bareos-21.1.5-r2/work/bareos-Release-21.1.5/debian/bareos-tools.install
-- creating file /var/tmp/portage/app-backup/bareos-21.1.5-r2/work/bareos-Release-21.1.5/debian/bareos-tools.postinst
-- creating file /var/tmp/portage/app-backup/bareos-21.1.5-r2/work/bareos-Release-21.1.5/debian/bareos-traymonitor.install
-- creating file /var/tmp/portage/app-backup/bareos-21.1.5-r2/work/bareos-Release-21.1.5/debian/bareos-traymonitor.postinst
-- creating file /var/tmp/portage/app-backup/bareos-21.1.5-r2/work/bareos-Release-21.1.5/debian/bareos-universal-client.install
-- creating file /var/tmp/portage/app-backup/bareos-21.1.5-r2/work/bareos-Release-21.1.5/debian/bareos-universal-client.postinst
-- creating file /var/tmp/portage/app-backup/bareos-21.1.5-r2/work/bareos-Release-21.1.5/debian/bareos-universal-client.preinst
-- creating file /var/tmp/portage/app-backup/bareos-21.1.5-r2/work/bareos-Release-21.1.5/debian/univention-bareos.postinst
Entering /var/tmp/portage/app-backup/bareos-21.1.5-r2/work/bareos-Release-21.1.5/core/scripts
Entering /var/tmp/portage/app-backup/bareos-21.1.5-r2/work/bareos-Release-21.1.5/core/manpages
Entering /var/tmp/portage/app-backup/bareos-21.1.5-r2/work/bareos-Release-21.1.5/core/platforms
-- UNITDIR: 
-- BAREOS_PLATFORM: gentoo
-- PLATFORM: gentoo
Entering /var/tmp/portage/app-backup/bareos-21.1.5-r2/work/bareos-Release-21.1.5/core/src
Entering /var/tmp/portage/app-backup/bareos-21.1.5-r2/work/bareos-Release-21.1.5/core/src/filed
Entering /var/tmp/portage/app-backup/bareos-21.1.5-r2/work/bareos-Release-21.1.5/core/src/tools
Entering /var/tmp/portage/app-backup/bareos-21.1.5-r2/work/bareos-Release-21.1.5/core/src/cats
Entering /var/tmp/portage/app-backup/bareos-21.1.5-r2/work/bareos-Release-21.1.5/core/src/stored
Backends are now unix_tape_device.d;unix_fifo_device.d
-- BACKEND_OBJECTS ARE 
Entering /var/tmp/portage/app-backup/bareos-21.1.5-r2/work/bareos-Release-21.1.5/core/src/stored/backends
Entering /var/tmp/portage/app-backup/bareos-21.1.5-r2/work/bareos-Release-21.1.5/core/src/dird
using BACKENDS: unix_tape_device.d;unix_fifo_device.d
using PLUGINS: python-ldap;python-ovirt
-- Skipping unit tests as gtest was not found
Entering /var/tmp/portage/app-backup/bareos-21.1.5-r2/work/bareos-Release-21.1.5/core/src/lib
Entering /var/tmp/portage/app-backup/bareos-21.1.5-r2/work/bareos-Release-21.1.5/core/src/findlib
Entering /var/tmp/portage/app-backup/bareos-21.1.5-r2/work/bareos-Release-21.1.5/core/src/plugins
Entering /var/tmp/portage/app-backup/bareos-21.1.5-r2/work/bareos-Release-21.1.5/core/src/plugins/dird
Entering /var/tmp/portage/app-backup/bareos-21.1.5-r2/work/bareos-Release-21.1.5/core/src/plugins/stored
Entering /var/tmp/portage/app-backup/bareos-21.1.5-r2/work/bareos-Release-21.1.5/core/src/plugins/filed
Entering /var/tmp/portage/app-backup/bareos-21.1.5-r2/work/bareos-Release-21.1.5/core/src/fastlz
 
Configuration on 2023-02-17 21:19:14 : 
 
   Host:                         Linux-5.15.85-gentoo-dist -- gentoo 2.13 
   Hostname:                     localhost 
   Bareos version:               Bareos 21.1.5 (09 November 2022) 
   Build platform:               gentoo
   Source code location:         /var/tmp/portage/app-backup/bareos-21.1.5-r2/work/bareos-Release-21.1.5/core 
   Install binaries:             /usr/bin 
   Install system binaries:      /usr/sbin 
   Install libraries:            /usr/lib64 
   Install system config files:  /etc 
   Install Bareos config dir:    /etc/bareos 
   Install Bareos config files:  /etc/bareos 
   Log directory:                /var/log/bareos 
   Scripts directory:            /usr/libexec/bareos 
   Archive directory:            /var/lib/bareos/storage 
   Working directory:            /var/lib/bareos 
   BSR directory:                /var/lib/bareos/bsr 
   Subsys directory:             /run/lock/subsys 
   Man directory:                /usr/share/man 
   Data directory:               /usr/share 
   Backend directory:            /usr/lib64/bareos/backend 
   Plugin directory:             /usr/lib64/bareos/plugin 
   C Compiler:                   /usr/bin/x86_64-pc-linux-gnu-gcc 13.0.1 
   C++ Compiler:                 /usr/bin/x86_64-pc-linux-gnu-g++ 13.0.1 
   C Compiler flags:             -O2 -march=x86-64 -pipe -pipe -frecord-gcc-switches -fno-diagnostics-color -fmessage-length=0 -fdebug-prefix-map=/var/tmp/portage/app-backup/bareos-21.1.5-r2/work/bareos-Release-21.1.5/core=. -fmacro-prefix-map=/var/tmp/portage/app-backup/bareos-21.1.5-r2/work/bareos-Release-21.1.5/core=. -Wall 
   C++ Compiler flags:           -O2 -march=x86-64 -pipe -pipe -frecord-gcc-switches -fno-diagnostics-color -fmessage-length=0 -Wsuggest-override -Wformat -Wformat-security -fdebug-prefix-map=/var/tmp/portage/app-backup/bareos-21.1.5-r2/work/bareos-Release-21.1.5/core=. -fmacro-prefix-map=/var/tmp/portage/app-backup/bareos-21.1.5-r2/work/bareos-Release-21.1.5/core=. -Wno-unknown-pragmas -Wall 
   Linker flags:                 -Wl,-O1 -Wl,--as-needed -Wl,--defsym=__gentoo_check_ldflags__=0 -Wl,-O1 -Wl,--as-needed -Wl,--defsym=__gentoo_check_ldflags__=0 -Wl,-O1 -Wl,--as-needed -Wl,--defsym=__gentoo_check_ldflags__=0  
   Libraries:                     
   Statically Linked Tools:       
   Statically Linked FD:          
   Statically Linked SD:          
   Statically Linked DIR:         
   Statically Linked CONS:        
   Database backends:            postgresql 
   default_db_backend:           postgresql 
   db_backend_to_test:           postgresql 
   Database port:                 
   Database name:                bareos 
   Database user:                bareos 
   Database version:             2210 
 
   Job Output Email:             root 
   Traceback Email:              root 
   SMTP Host Address:            localhost 
 
   Director Port:                9101 
   File daemon Port:             9102 
   Storage daemon Port:          9103 
 
   Director User:                bareos 
   Director Group:               bareos 
   Storage Daemon User:          root 
   Storage DaemonGroup:          bareos 
   File Daemon User:             root 
   File Daemon Group:            bareos 
 
   readline support:             ROOT_DIR:/usr INCLUDE_DIR:/usr/include LIBRARY:/usr/lib64/libreadline.so
 
   TLS support:                  1 
   Encryption support:           1 
   OpenSSL support:              TRUE 3.0.8 /usr/include /usr/lib64/libssl.so;/usr/lib64/libcrypto.so 
   PAM support:                  TRUE /usr/include /usr/lib64/libpam.so 
   ZLIB support:                 TRUE /usr/include /usr/lib64/libz.so 
   LZO2 support:                 TRUE /usr/include /usr/lib64/liblzo2.so 
   JANSSON support:              TRUE 2.14 /usr/include /usr/lib64/libjansson.so
   VIXDISKLIB support:           FALSE   
   LMDB support:                 no 
   NDMP support:                 no 
   Build ndmjob binary:          OFF 
   enable-lockmgr:               OFF 
   tray-monitor support:         0 
   test-plugin support:           
   client-only:                  OFF 
   Plugin support:                
   AFS support:                   
   ACL support:                  1 /usr/lib64/libacl.so
   XATTR support:                YES 
   SCSI Crypto support:          no  
   GFAPI(GLUSTERFS) support:     FALSE   
   CEPH RADOS support:           FALSE   
   RADOS striping support:       FALSE   
   CEPHFS support:               FALSE   
   Python2 support:              FALSE  _Python2_INCLUDE_DIR-NOTFOUND _Python2_EXECUTABLE-NOTFOUND
   Python3 support:              TRUE 3.11.2 /usr/include/python3.11 /var/tmp/portage/app-backup/bareos-21.1.5-r2/temp/python3.11/bin/python3
   systemd support:              OFF 
   Batch insert enabled:         1
   PostgreSQL Version:           15.2 
   GTest enabled:                0
   Intl support:                 TRUE  
   Dynamic cats backends:        yes 1 
   Dynamic storage backends:     yes 1 unix_tape_device.d;unix_fifo_device.d 
   PLUGINS:                      python-ldap;python-ovirt 
   Build for Test Coverage :     no 
   PSCMD:                        /bin/ps -e
   PS:                           /bin/ps
   PIDOF:                        /usr/bin/pidof
   PGREP:                        /usr/bin/pgrep
   AWK:                          /usr/bin/awk
   GAWK:                         /usr/bin/gawk
   GDB:                          GDB-NOTFOUND
   RPCGEN:                       RPCGEN-NOTFOUND
   MTX:                          /usr/sbin/mtx
   MT:                           /usr/sbin/mt
   MINIO:                        MINIO-NOTFOUND
   S3CMD:                        S3CMD-NOTFOUND
   DEVELOPER:                    OFF
   LocalBuildDefinitionsFile:    NOTFOUND
   HAVE_IS_TRIVIALLY_COPYABLE:   TRUE
   do-static-code-checks:        OFF
Entering /var/tmp/portage/app-backup/bareos-21.1.5-r2/work/bareos-Release-21.1.5/systemtests
   SYSTEMTESTS_S3_USE_HTTPS: ON
-- POSTGRES_BIN_PATH is /usr/bin
-- RUN_SYSTEMTESTS_ON_INSTALLED_FILES="OFF"
-- Looking for binaries and paths...
   BAREOS_DIR_TO_TEST is /var/tmp/portage/app-backup/bareos-21.1.5-r2/work/bareos-21.1.5_build/core/src/dird/bareos-dir
   BAREOS_DBCHECK_TO_TEST is /var/tmp/portage/app-backup/bareos-21.1.5-r2/work/bareos-21.1.5_build/core/src/dird/bareos-dbcheck
   BAREOS_FD_TO_TEST is /var/tmp/portage/app-backup/bareos-21.1.5-r2/work/bareos-21.1.5_build/core/src/filed/bareos-fd
   BAREOS_SD_TO_TEST is /var/tmp/portage/app-backup/bareos-21.1.5-r2/work/bareos-21.1.5_build/core/src/stored/bareos-sd
   BCOPY_TO_TEST is /var/tmp/portage/app-backup/bareos-21.1.5-r2/work/bareos-21.1.5_build/core/src/stored/bcopy
   BTAPE_TO_TEST is /var/tmp/portage/app-backup/bareos-21.1.5-r2/work/bareos-21.1.5_build/core/src/stored/btape
   BEXTRACT_TO_TEST is /var/tmp/portage/app-backup/bareos-21.1.5-r2/work/bareos-21.1.5_build/core/src/stored/bextract
   BAREOS_SD_TO_TEST is /var/tmp/portage/app-backup/bareos-21.1.5-r2/work/bareos-21.1.5_build/core/src/stored/bareos-sd
   BLS_TO_TEST is /var/tmp/portage/app-backup/bareos-21.1.5-r2/work/bareos-21.1.5_build/core/src/stored/bls
   BSCAN_TO_TEST is /var/tmp/portage/app-backup/bareos-21.1.5-r2/work/bareos-21.1.5_build/core/src/stored/bscan
   BCONSOLE_TO_TEST is /var/tmp/portage/app-backup/bareos-21.1.5-r2/work/bareos-21.1.5_build/core/src/console/bconsole
   BSMTP_TO_TEST is /var/tmp/portage/app-backup/bareos-21.1.5-r2/work/bareos-21.1.5_build/core/src/tools/bsmtp
   BWILD_TO_TEST is /var/tmp/portage/app-backup/bareos-21.1.5-r2/work/bareos-21.1.5_build/core/src/tools/bwild
   BPLUGINFO_TO_TEST is /var/tmp/portage/app-backup/bareos-21.1.5-r2/work/bareos-21.1.5_build/core/src/tools/bpluginfo
   BSMTP_TO_TEST is /var/tmp/portage/app-backup/bareos-21.1.5-r2/work/bareos-21.1.5_build/core/src/tools/bsmtp
   BSCRYPTO_TO_TEST is /var/tmp/portage/app-backup/bareos-21.1.5-r2/work/bareos-21.1.5_build/core/src/tools/bscrypto
   BTESTLS_TO_TEST is /var/tmp/portage/app-backup/bareos-21.1.5-r2/work/bareos-21.1.5_build/core/src/tools/btestls
   DRIVETYPE_TO_TEST is /var/tmp/portage/app-backup/bareos-21.1.5-r2/work/bareos-21.1.5_build/core/src/tools/drivetype
   FSTYPE_TO_TEST is /var/tmp/portage/app-backup/bareos-21.1.5-r2/work/bareos-21.1.5_build/core/src/tools/fstype
   BREGEX_TO_TEST is /var/tmp/portage/app-backup/bareos-21.1.5-r2/work/bareos-21.1.5_build/core/src/tools/bregex
-- FD_PLUGINS_DIR_TO_TEST="/var/tmp/portage/app-backup/bareos-21.1.5-r2/work/bareos-21.1.5_build/core/src/plugins/filed"
-- SD_PLUGINS_DIR_TO_TEST="/var/tmp/portage/app-backup/bareos-21.1.5-r2/work/bareos-21.1.5_build/core/src/plugins/stored"
-- DIR_PLUGINS_DIR_TO_TEST="/var/tmp/portage/app-backup/bareos-21.1.5-r2/work/bareos-21.1.5_build/core/src/plugins/dird"
-- BACKEND_DIR_TO_TEST="/var/tmp/portage/app-backup/bareos-21.1.5-r2/work/bareos-21.1.5_build/core/src/cats"
-- SD_BACKEND_DIR_TO_TEST="/var/tmp/portage/app-backup/bareos-21.1.5-r2/work/bareos-21.1.5_build/core/src/stored/backends"
-- WEBUI_PUBLIC_DIR_TO_TEST="/var/tmp/portage/app-backup/bareos-21.1.5-r2/work/bareos-Release-21.1.5/systemtests/../webui/public"
-- db version from cats.h is 2210
-- DEFAULT_DB_TYPE="postgresql"
-- Looking for pam test requirements ...
-- checking for library pam and security/pam_appl.h header ...
--   PAM_FOUND=TRUE
--   PAM_LIBRARIES=/usr/lib64/libpam.so
--   PAM_INCLUDE_DIRS=/usr/include
--   HAVE_PAM=1
-- checking for library pam_wrapper...
--               ERROR:  pam_wrapper libraries NOT found. 
--   PAM_WRAPPER_FOUND=FALSE
--   PAM_WRAPPER_LIBRARIES=
--   HAVE_LIBPAM_WRAPPER=0
/var/tmp/portage/app-backup/bareos-21.1.5-r2/work/bareos-Release-21.1.5/systemtests/tests/bconsole-pam/bin/check_pam_exec_available.sh: line 50: PAM_WRAPPER_LIBRARIES: unbound variable
   PAM_FOUND:                TRUE
   PAM_WRAPPER_LIBRARIES:    
   PAMTESTER:                PAMTESTER-NOTFOUND
   PAM_EXEC_AVAILABLE:       
-- NOT OK: disabling pam tests as not all requirements were found.
-- Looking for webui test requirements ...
-- python module pyversion 2 selenium NOT found
-- python module pyversion 3 selenium NOT found
   PHP:                    PHP-NOTFOUND
   PYTHON_EXECUTABLE:      /var/tmp/portage/app-backup/bareos-21.1.5-r2/temp/python3.11/bin/python3
   PYMODULE_2_SELENIUM_FOUND:FALSE
   PYMODULE_3_SELENIUM_FOUND:FALSE
   CHROMEDRIVER:           CHROMEDRIVER-NOTFOUND
-- NOT OK: disabling webui tests as not all requirements were found.
-- Disabled test: webui:admin-client_link_on_dashboard
-- Disabled test: webui:admin-client_disabling
-- Disabled test: webui:admin-rerun_job
-- Disabled test: webui:admin-restore
-- Disabled test: webui:admin-run_configured_job
-- Disabled test: webui:admin-run_default_job
-- Disabled test: webui:readonly-client_disabling
-- Disabled test: webui:readonly-rerun_job
-- Disabled test: webui:readonly-restore
-- Disabled test: webui:readonly-run_configured_job
-- Disabled test: webui:readonly-run_default_job
running cd "/var/tmp/portage/app-backup/bareos-21.1.5-r2/work/bareos-21.1.5_build/systemtests/tests/acl" && /bin/setfacl -m user:0:rw- acl-test-file.txt  2>&1
-- Test: system:acl (baseport=30001)
--       * system:acl
-- Test: system:always-incremental-consolidate (baseport=30011)
--       * system:always-incremental-consolidate
-- Test: system:autochanger => disabled ()
-- Test: system:bareos (baseport=30021)
--       * system:bareos:setup
--       * system:bareos:simple-backup-and-restore
--       * system:bareos:status-subscriptions
--       * system:bareos:very-long-job-names
--       * system:bareos:cleanup
-- Test: system:bareos-acl (baseport=30031)
--       * system:bareos-acl
-- Test: system:bconsole (baseport=30041)
--       * system:bconsole:setup
--       * system:bconsole:autocompletion
--       * system:bconsole:dotjobstatus
--       * system:bconsole:status-client
--       * system:bconsole:cleanup
-- Test: system:bconsole-pam => disabled ()
-- Test: system:block-size => disabled ()
-- Test: system:bscan-bextract-bls (baseport=30051)
--       * system:bscan-bextract-bls
-- Could NOT find GTest (missing: GTest_DIR)
-- Test: system:catalog => disabled (gtest not found or RUN_SYSTEMTESTS_ON_INSTALLED_FILES)
-- Test: system:chflags => disabled ()
-- Test: system:client-initiated (baseport=30061)
--       * system:client-initiated
-- Test: system:config-dump (baseport=30071)
--       * system:config-dump
-- Test: system:config-syntax-crash (baseport=30081)
--       * system:config-syntax-crash
-- Test: system:copy (baseport=30091)
--       * system:copy:setup
--       * system:copy:01-backup
--       * system:copy:02-copy
--       * system:copy:03-impossible-copy
--       * system:copy:04-bscan
--       * system:copy:cleanup
-- Test: system:copy-archive-job (baseport=30101)
--       * system:copy-archive-job
-- Test: system:copy-remote-bscan (baseport=30111)
--       * system:copy-remote-bscan
-- Test: system:dbcopy-mysql-postgresql => disabled ()
-- Test: system:deprecation (baseport=30121)
--       * system:deprecation
-- Test: system:droplet-s3 => disabled ()
-- Test: system:encrypt-signature (baseport=30131)
--       * system:encrypt-signature
-- Test: system:encrypt-signature-tls-cert (baseport=30141)
--       * system:encrypt-signature-tls-cert
-- Test: system:fileset-multiple-blocks (baseport=30151)
--       * system:fileset-multiple-blocks:setup
--       * system:fileset-multiple-blocks:include-blocks
--       * system:fileset-multiple-blocks:options-blocks
--       * system:fileset-multiple-blocks:cleanup
-- Test: system:filesets (baseport=30161)
--       * system:filesets
-- Test: system:gfapi-fd => disabled ()
-- Test: system:glusterfs-backend => disabled ()
-- Test: system:list-backups (baseport=30171)
--       * system:list-backups
-- Test: system:messages => disabled ()
-- Test: system:multiplied-device (baseport=30181)
--       * system:multiplied-device
-- Test: system:ndmp => disabled (ndmp_data_agent_address not given)
-- Test: system:notls (baseport=30191)
--       * system:notls
-- Test: system:passive (baseport=30201)
--       * system:passive
-- Test: system:py2plug-dir => disabled (no python-dir)
-- Test: system:py3plug-dir (baseport=30211)
--       * system:py3plug-dir
-- python module pyversion 2 ldap NOT found
-- Test: system:py2plug-fd-ldap => disabled ()
-- Test: system:py2plug-fd-libcloud => disabled (requires python-fd (Python2))
-- python module pyversion 3 libcloud NOT found
-- Test: system:py3plug-fd-libcloud => disabled (S3CMD, MINIO or LIBCLOUD MODULE not found or Python > 3.7)
-- Test: system:py2plug-fd-local-fileset => disabled ()
-- Test: system:py3plug-fd-local-fileset (baseport=30221)
--       * system:py3plug-fd-local-fileset
-- Test: system:py2plug-fd-local-fileset-restoreobject => disabled ()
-- Test: system:py3plug-fd-local-fileset-restoreobject (baseport=30231)
--       * system:py3plug-fd-local-fileset-restoreobject
-- Test: system:py2plug-fd-mariabackup => disabled (
    no python-fd or MARIABACKUP_BINARY,MARIADB_DAEMON_BINARY,MARIADB_CLIENT_BINARY or MARIADB_MYSQL_INSTALL_DB_SCRIPT not set.
    example:
    cmake -D MARIABACKUP_BINARY=/usr/bin/mariabackup     -D MARIADB_DAEMON_BINARY=/usr/libexec/mysqld     -D MARIADB_CLIENT_BINARY=/usr/bin/mysql     -D MARIADB_MYSQL_INSTALL_DB_SCRIPT=/usr/bin/mysql_install_db)
-- Test: system:py3plug-fd-mariabackup => disabled (
    no python-fd or MARIABACKUP_BINARY,MARIADB_DAEMON_BINARY,MARIADB_CLIENT_BINARY or MARIADB_MYSQL_INSTALL_DB_SCRIPT not set.
    example:
    cmake -D MARIABACKUP_BINARY=/usr/bin/mariabackup     -D MARIADB_DAEMON_BINARY=/usr/libexec/mysqld     -D MARIADB_CLIENT_BINARY=/usr/bin/mysql     -D MARIADB_MYSQL_INSTALL_DB_SCRIPT=/usr/bin/mysql_install_db)
-- Test: system:py2plug-fd-ovirt => disabled (no python-fd or ovirt_server not set)
-- Test: system:py3plug-fd-ovirt => disabled (no python3-fd or ovirt_server not set)
-- Test: system:py2plug-fd-percona-xtrabackup => disabled (
    no python-fd or XTRABACKUP_BINARY,MYSQL_DAEMON_BINARY or MYSQL_CLIENT_BINARY not set.)
    example:
    cmake -D XTRABACKUP_BINARY=/usr/bin/xtrabackup
    -D MYSQL_DAEMON_BINARY=/opt/mysql/bin/mysqld
    -D MYSQL_CLIENT_BINARY=/usr/bin/mysql)
-- Test: system:py3plug-fd-percona-xtrabackup => disabled (
    no python3-fd or XTRABACKUP_BINARY,MYSQL_DAEMON_BINARY or MYSQL_CLIENT_BINARY not set.)
    example:
    cmake -D XTRABACKUP_BINARY=/usr/bin/xtrabackup
    -D MYSQL_DAEMON_BINARY=/opt/mysql/bin/mysqld
    -D MYSQL_CLIENT_BINARY=/usr/bin/mysql)
-- python module pyversion 3 pg8000 NOT found
-- python module pyversion 3 dateutil NOT found
-- Test: system:py3plug-fd-postgres => disabled ()
-- Test: system:py2plug-fd-vmware => disabled (no python-fd or vmware_server not set)
-- Test: system:py3plug-fd-vmware => disabled (no python3-fd or vmware_server not set)
-- Test: system:py2plug-sd => disabled (no python-sd)
-- Test: system:py3plug-sd (baseport=30241)
--       * system:py3plug-sd
-- Test: system:python-bareos (baseport=30251)
--       * system:python-bareos:setup
--       * system:python-bareos:acl
--       * system:python-bareos:bvfs
--       * system:python-bareos:delete
--       * system:python-bareos:filedaemon
--       * system:python-bareos:json
--       * system:python-bareos:json_config
--       * system:python-bareos:list_jobs
--       * system:python-bareos:plaintext
--       * system:python-bareos:protocol_124
--       * system:python-bareos:python_bareos_module
--       * system:python-bareos:runscript
--       * system:python-bareos:show
--       * system:python-bareos:tlspsk
--       * system:python-bareos:cleanup
-- Test: system:python-pam => disabled ()
-- Test: system:quota-softquota (baseport=30261)
--       * system:quota-softquota
-- Test: system:reload (baseport=30271)
--       * system:reload:setup
--       * system:reload:add-client
--       * system:reload:add-duplicate-job
--       * system:reload:add-empty-job
--       * system:reload:add-second-director
--       * system:reload:add-uncommented-string
--       * system:reload:unchanged-config
--       * system:reload:cleanup
-- python module pyversion 3 fastapi NOT found
-- python module pyversion 3 uvicorn NOT found
-- Test: system:restapi => disabled ()
-- Test: system:scheduler-backup (baseport=30281)
--       * system:scheduler-backup:setup
--       * system:scheduler-backup:scheduler-backup
--       * system:scheduler-backup:scheduler-status-copy-job
--       * system:scheduler-backup:cleanup
-- Test: system:sparse-file (baseport=30291)
--       * system:sparse-file
-- Test: system:spool (baseport=30301)
--       * system:spool
-- Test: system:truncate-command (baseport=30311)
--       * system:truncate-command
-- Test: system:upgrade-database (baseport=30321)
--       * system:upgrade-database
-- Test: system:virtualfull (baseport=30331)
--       * system:virtualfull
-- Test: system:virtualfull-bscan (baseport=30341)
--       * system:virtualfull-bscan
-- Test: system:volume-pruning (baseport=30351)
--       * system:volume-pruning
running cd "/var/tmp/portage/app-backup/bareos-21.1.5-r2/work/bareos-21.1.5_build/systemtests/tests/xattr" && /bin/setfattr --name=user.cmake-check --value=xattr-value xattr-test-file.txt  2>&1
setfattr: xattr-test-file.txt: Operation not supported
-- Test: system:xattr => disabled ()
-- <<< Gentoo configuration >>>
Build type      Gentoo
Install path    /usr
Compiler flags:
C               -O2 -march=x86-64 -pipe -pipe -frecord-gcc-switches -fno-diagnostics-color -fmessage-length=0
C++             -O2 -march=x86-64 -pipe -pipe -frecord-gcc-switches -fno-diagnostics-color -fmessage-length=0
Linker flags:
Executable      -Wl,-O1 -Wl,--as-needed -Wl,--defsym=__gentoo_check_ldflags__=0
Module          -Wl,-O1 -Wl,--as-needed -Wl,--defsym=__gentoo_check_ldflags__=0
Shared          -Wl,-O1 -Wl,--as-needed -Wl,--defsym=__gentoo_check_ldflags__=0

-- Configuring done
-- Generating done
-- Build files have been written to: /var/tmp/portage/app-backup/bareos-21.1.5-r2/work/bareos-21.1.5_build
>>> Source configured.
>>> Compiling source in /var/tmp/portage/app-backup/bareos-21.1.5-r2/work/bareos-Release-21.1.5 ...
 * Source directory (CMAKE_USE_DIR): "/var/tmp/portage/app-backup/bareos-21.1.5-r2/work/bareos-Release-21.1.5"
 * Build directory  (BUILD_DIR):     "/var/tmp/portage/app-backup/bareos-21.1.5-r2/work/bareos-21.1.5_build"
ninja -v -j16 -l0
[0/2] /usr/bin/cmake -P /var/tmp/portage/app-backup/bareos-21.1.5-r2/work/bareos-21.1.5_build/CMakeFiles/VerifyGlobs.cmake
[1/362] /usr/bin/x86_64-pc-linux-gnu-g++ -D_FILE_OFFSET_BITS=64 -I/usr/include/tirpc -I/var/tmp/portage/app-backup/bareos-21.1.5-r2/work/bareos-Release-21.1.5/core/src -I/var/tmp/portage/app-backup/bareos-21.1.5-r2/work/bareos-Release-21.1.5/core/src/fastlz/include  -O2 -march=x86-64 -pipe -pipe -frecord-gcc-switches -fno-diagnostics-color -fmessage-length=0 -Wsuggest-override -Wformat -Wformat-security -fdebug-prefix-map=/var/tmp/portage/app-backup/bareos-21.1.5-r2/work/bareos-Release-21.1.5/core=. -fmacro-prefix-map=/var/tmp/portage/app-backup/bareos-21.1.5-r2/work/bareos-Release-21.1.5/core=. -Wno-unknown-pragmas -Wall -Wno-deprecated-declarations -std=gnu++17 -MD -MT core/src/filed/CMakeFiles/fd_objects.dir/filed_globals.cc.o -MF core/src/filed/CMakeFiles/fd_objects.dir/filed_globals.cc.o.d -o core/src/filed/CMakeFiles/fd_objects.dir/filed_globals.cc.o -c /var/tmp/portage/app-backup/bareos-21.1.5-r2/work/bareos-Release-21.1.5/core/src/filed/filed_globals.cc
[2/362] /usr/bin/x86_64-pc-linux-gnu-g++ -D_FILE_OFFSET_BITS=64 -I/usr/include/tirpc -I/var/tmp/portage/app-backup/bareos-21.1.5-r2/work/bareos-Release-21.1.5/core/src -I/var/tmp/portage/app-backup/bareos-21.1.5-r2/work/bareos-Release-21.1.5/core/src/fastlz/include  -O2 -march=x86-64 -pipe -pipe -frecord-gcc-switches -fno-diagnostics-color -fmessage-length=0 -Wsuggest-override -Wformat -Wformat-security -fdebug-prefix-map=/var/tmp/portage/app-backup/bareos-21.1.5-r2/work/bareos-Release-21.1.5/core=. -fmacro-prefix-map=/var/tmp/portage/app-backup/bareos-21.1.5-r2/work/bareos-Release-21.1.5/core=. -Wno-unknown-pragmas -Wall -Wno-deprecated-declarations -std=gnu++17 -MD -MT core/src/filed/CMakeFiles/fd_objects.dir/evaluate_job_command.cc.o -MF core/src/filed/CMakeFiles/fd_objects.dir/evaluate_job_command.cc.o.d -o core/src/filed/CMakeFiles/fd_objects.dir/evaluate_job_command.cc.o -c /var/tmp/portage/app-backup/bareos-21.1.5-r2/work/bareos-Release-21.1.5/core/src/filed/evaluate_job_command.cc
[3/362] /usr/bin/x86_64-pc-linux-gnu-g++ -D_FILE_OFFSET_BITS=64 -I/usr/include/tirpc -I/var/tmp/portage/app-backup/bareos-21.1.5-r2/work/bareos-Release-21.1.5/core/src -I/var/tmp/portage/app-backup/bareos-21.1.5-r2/work/bareos-Release-21.1.5/core/src/fastlz/include  -O2 -march=x86-64 -pipe -pipe -frecord-gcc-switches -fno-diagnostics-color -fmessage-length=0 -Wsuggest-override -Wformat -Wformat-security -fdebug-prefix-map=/var/tmp/portage/app-backup/bareos-21.1.5-r2/work/bareos-Release-21.1.5/core=. -fmacro-prefix-map=/var/tmp/portage/app-backup/bareos-21.1.5-r2/work/bareos-Release-21.1.5/core=. -Wno-unknown-pragmas -Wall -Wno-deprecated-declarations -std=gnu++17 -MD -MT core/src/filed/CMakeFiles/fd_objects.dir/accurate_lmdb.cc.o -MF core/src/filed/CMakeFiles/fd_objects.dir/accurate_lmdb.cc.o.d -o core/src/filed/CMakeFiles/fd_objects.dir/accurate_lmdb.cc.o -c /var/tmp/portage/app-backup/bareos-21.1.5-r2/work/bareos-Release-21.1.5/core/src/filed/accurate_lmdb.cc
[4/362] /usr/bin/x86_64-pc-linux-gnu-g++ -D_FILE_OFFSET_BITS=64 -I/usr/include/tirpc -I/var/tmp/portage/app-backup/bareos-21.1.5-r2/work/bareos-Release-21.1.5/core/src -I/var/tmp/portage/app-backup/bareos-21.1.5-r2/work/bareos-Release-21.1.5/core/src/fastlz/include  -O2 -march=x86-64 -pipe -pipe -frecord-gcc-switches -fno-diagnostics-color -fmessage-length=0 -Wsuggest-override -Wformat -Wformat-security -fdebug-prefix-map=/var/tmp/portage/app-backup/bareos-21.1.5-r2/work/bareos-Release-21.1.5/core=. -fmacro-prefix-map=/var/tmp/portage/app-backup/bareos-21.1.5-r2/work/bareos-Release-21.1.5/core=. -Wno-unknown-pragmas -Wall -Wno-deprecated-declarations -std=gnu++17 -MD -MT core/src/filed/CMakeFiles/fd_objects.dir/accurate_htable.cc.o -MF core/src/filed/CMakeFiles/fd_objects.dir/accurate_htable.cc.o.d -o core/src/filed/CMakeFiles/fd_objects.dir/accurate_htable.cc.o -c /var/tmp/portage/app-backup/bareos-21.1.5-r2/work/bareos-Release-21.1.5/core/src/filed/accurate_htable.cc
[5/362] /usr/bin/x86_64-pc-linux-gnu-g++ -D_FILE_OFFSET_BITS=64 -I/usr/include/tirpc -I/var/tmp/portage/app-backup/bareos-21.1.5-r2/work/bareos-Release-21.1.5/core/src -I/var/tmp/portage/app-backup/bareos-21.1.5-r2/work/bareos-Release-21.1.5/core/src/fastlz/include  -O2 -march=x86-64 -pipe -pipe -frecord-gcc-switches -fno-diagnostics-color -fmessage-length=0 -Wsuggest-override -Wformat -Wformat-security -fdebug-prefix-map=/var/tmp/portage/app-backup/bareos-21.1.5-r2/work/bareos-Release-21.1.5/core=. -fmacro-prefix-map=/var/tmp/portage/app-backup/bareos-21.1.5-r2/work/bareos-Release-21.1.5/core=. -Wno-unknown-pragmas -Wall -Wno-deprecated-declarations -std=gnu++17 -MD -MT core/src/filed/CMakeFiles/fd_objects.dir/compression.cc.o -MF core/src/filed/CMakeFiles/fd_objects.dir/compression.cc.o.d -o core/src/filed/CMakeFiles/fd_objects.dir/compression.cc.o -c /var/tmp/portage/app-backup/bareos-21.1.5-r2/work/bareos-Release-21.1.5/core/src/filed/compression.cc
[6/362] /usr/bin/x86_64-pc-linux-gnu-g++ -D_FILE_OFFSET_BITS=64 -I/usr/include/tirpc -I/var/tmp/portage/app-backup/bareos-21.1.5-r2/work/bareos-Release-21.1.5/core/src -I/var/tmp/portage/app-backup/bareos-21.1.5-r2/work/bareos-Release-21.1.5/core/src/fastlz/include  -O2 -march=x86-64 -pipe -pipe -frecord-gcc-switches -fno-diagnostics-color -fmessage-length=0 -Wsuggest-override -Wformat -Wformat-security -fdebug-prefix-map=/var/tmp/portage/app-backup/bareos-21.1.5-r2/work/bareos-Release-21.1.5/core=. -fmacro-prefix-map=/var/tmp/portage/app-backup/bareos-21.1.5-r2/work/bareos-Release-21.1.5/core=. -Wno-unknown-pragmas -Wall -Wno-deprecated-declarations -std=gnu++17 -MD -MT core/src/filed/CMakeFiles/fd_objects.dir/sd_cmds.cc.o -MF core/src/filed/CMakeFiles/fd_objects.dir/sd_cmds.cc.o.d -o core/src/filed/CMakeFiles/fd_objects.dir/sd_cmds.cc.o -c /var/tmp/portage/app-backup/bareos-21.1.5-r2/work/bareos-Release-21.1.5/core/src/filed/sd_cmds.cc
[7/362] /usr/bin/x86_64-pc-linux-gnu-g++ -D_FILE_OFFSET_BITS=64 -I/usr/include/tirpc -I/var/tmp/portage/app-backup/bareos-21.1.5-r2/work/bareos-Release-21.1.5/core/src -I/var/tmp/portage/app-backup/bareos-21.1.5-r2/work/bareos-Release-21.1.5/core/src/fastlz/include  -O2 -march=x86-64 -pipe -pipe -frecord-gcc-switches -fno-diagnostics-color -fmessage-length=0 -Wsuggest-override -Wformat -Wformat-security -fdebug-prefix-map=/var/tmp/portage/app-backup/bareos-21.1.5-r2/work/bareos-Release-21.1.5/core=. -fmacro-prefix-map=/var/tmp/portage/app-backup/bareos-21.1.5-r2/work/bareos-Release-21.1.5/core=. -Wno-unknown-pragmas -Wall -Wno-deprecated-declarations -std=gnu++17 -MD -MT core/src/filed/CMakeFiles/fd_objects.dir/authenticate.cc.o -MF core/src/filed/CMakeFiles/fd_objects.dir/authenticate.cc.o.d -o core/src/filed/CMakeFiles/fd_objects.dir/authenticate.cc.o -c /var/tmp/portage/app-backup/bareos-21.1.5-r2/work/bareos-Release-21.1.5/core/src/filed/authenticate.cc
[8/362] /usr/bin/x86_64-pc-linux-gnu-g++ -D_FILE_OFFSET_BITS=64 -I/usr/include/tirpc -I/var/tmp/portage/app-backup/bareos-21.1.5-r2/work/bareos-Release-21.1.5/core/src -I/var/tmp/portage/app-backup/bareos-21.1.5-r2/work/bareos-Release-21.1.5/core/src/fastlz/include  -O2 -march=x86-64 -pipe -pipe -frecord-gcc-switches -fno-diagnostics-color -fmessage-length=0 -Wsuggest-override -Wformat -Wformat-security -fdebug-prefix-map=/var/tmp/portage/app-backup/bareos-21.1.5-r2/work/bareos-Release-21.1.5/core=. -fmacro-prefix-map=/var/tmp/portage/app-backup/bareos-21.1.5-r2/work/bareos-Release-21.1.5/core=. -Wno-unknown-pragmas -Wall -Wno-deprecated-declarations -std=gnu++17 -MD -MT core/src/filed/CMakeFiles/fd_objects.dir/socket_server.cc.o -MF core/src/filed/CMakeFiles/fd_objects.dir/socket_server.cc.o.d -o core/src/filed/CMakeFiles/fd_objects.dir/socket_server.cc.o -c /var/tmp/portage/app-backup/bareos-21.1.5-r2/work/bareos-Release-21.1.5/core/src/filed/socket_server.cc
[9/362] /usr/bin/x86_64-pc-linux-gnu-g++ -D_FILE_OFFSET_BITS=64 -I/usr/include/tirpc -I/var/tmp/portage/app-backup/bareos-21.1.5-r2/work/bareos-Release-21.1.5/core/src -I/var/tmp/portage/app-backup/bareos-21.1.5-r2/work/bareos-Release-21.1.5/core/src/fastlz/include  -O2 -march=x86-64 -pipe -pipe -frecord-gcc-switches -fno-diagnostics-color -fmessage-length=0 -Wsuggest-override -Wformat -Wformat-security -fdebug-prefix-map=/var/tmp/portage/app-backup/bareos-21.1.5-r2/work/bareos-Release-21.1.5/core=. -fmacro-prefix-map=/var/tmp/portage/app-backup/bareos-21.1.5-r2/work/bareos-Release-21.1.5/core=. -Wno-unknown-pragmas -Wall -Wno-deprecated-declarations -std=gnu++17 -MD -MT core/src/filed/CMakeFiles/fd_objects.dir/verify_vol.cc.o -MF core/src/filed/CMakeFiles/fd_objects.dir/verify_vol.cc.o.d -o core/src/filed/CMakeFiles/fd_objects.dir/verify_vol.cc.o -c /var/tmp/portage/app-backup/bareos-21.1.5-r2/work/bareos-Release-21.1.5/core/src/filed/verify_vol.cc
[10/362] /usr/bin/x86_64-pc-linux-gnu-g++ -D_FILE_OFFSET_BITS=64 -I/usr/include/tirpc -I/var/tmp/portage/app-backup/bareos-21.1.5-r2/work/bareos-Release-21.1.5/core/src -I/var/tmp/portage/app-backup/bareos-21.1.5-r2/work/bareos-Release-21.1.5/core/src/fastlz/include  -O2 -march=x86-64 -pipe -pipe -frecord-gcc-switches -fno-diagnostics-color -fmessage-length=0 -Wsuggest-override -Wformat -Wformat-security -fdebug-prefix-map=/var/tmp/portage/app-backup/bareos-21.1.5-r2/work/bareos-Release-21.1.5/core=. -fmacro-prefix-map=/var/tmp/portage/app-backup/bareos-21.1.5-r2/work/bareos-Release-21.1.5/core=. -Wno-unknown-pragmas -Wall -Wno-deprecated-declarations -std=gnu++17 -MD -MT core/src/filed/CMakeFiles/fd_objects.dir/accurate.cc.o -MF core/src/filed/CMakeFiles/fd_objects.dir/accurate.cc.o.d -o core/src/filed/CMakeFiles/fd_objects.dir/accurate.cc.o -c /var/tmp/portage/app-backup/bareos-21.1.5-r2/work/bareos-Release-21.1.5/core/src/filed/accurate.cc
[11/362] /usr/bin/x86_64-pc-linux-gnu-g++ -D_FILE_OFFSET_BITS=64 -I/usr/include/tirpc -I/var/tmp/portage/app-backup/bareos-21.1.5-r2/work/bareos-Release-21.1.5/core/src -I/var/tmp/portage/app-backup/bareos-21.1.5-r2/work/bareos-Release-21.1.5/core/src/fastlz/include  -O2 -march=x86-64 -pipe -pipe -frecord-gcc-switches -fno-diagnostics-color -fmessage-length=0 -Wsuggest-override -Wformat -Wformat-security -fdebug-prefix-map=/var/tmp/portage/app-backup/bareos-21.1.5-r2/work/bareos-Release-21.1.5/core=. -fmacro-prefix-map=/var/tmp/portage/app-backup/bareos-21.1.5-r2/work/bareos-Release-21.1.5/core=. -Wno-unknown-pragmas -Wall -Wno-deprecated-declarations -std=gnu++17 -MD -MT core/src/filed/CMakeFiles/fd_objects.dir/crypto.cc.o -MF core/src/filed/CMakeFiles/fd_objects.dir/crypto.cc.o.d -o core/src/filed/CMakeFiles/fd_objects.dir/crypto.cc.o -c /var/tmp/portage/app-backup/bareos-21.1.5-r2/work/bareos-Release-21.1.5/core/src/filed/crypto.cc
[12/362] /usr/bin/x86_64-pc-linux-gnu-g++ -D_FILE_OFFSET_BITS=64 -I/usr/include/tirpc -I/var/tmp/portage/app-backup/bareos-21.1.5-r2/work/bareos-Release-21.1.5/core/src -I/var/tmp/portage/app-backup/bareos-21.1.5-r2/work/bareos-Release-21.1.5/core/src/fastlz/include  -O2 -march=x86-64 -pipe -pipe -frecord-gcc-switches -fno-diagnostics-color -fmessage-length=0 -Wsuggest-override -Wformat -Wformat-security -fdebug-prefix-map=/var/tmp/portage/app-backup/bareos-21.1.5-r2/work/bareos-Release-21.1.5/core=. -fmacro-prefix-map=/var/tmp/portage/app-backup/bareos-21.1.5-r2/work/bareos-Release-21.1.5/core=. -Wno-unknown-pragmas -Wall -Wno-deprecated-declarations -std=gnu++17 -MD -MT core/src/filed/CMakeFiles/fd_objects.dir/verify.cc.o -MF core/src/filed/CMakeFiles/fd_objects.dir/verify.cc.o.d -o core/src/filed/CMakeFiles/fd_objects.dir/verify.cc.o -c /var/tmp/portage/app-backup/bareos-21.1.5-r2/work/bareos-Release-21.1.5/core/src/filed/verify.cc
[13/362] /usr/bin/x86_64-pc-linux-gnu-g++ -D_FILE_OFFSET_BITS=64 -I/usr/include/tirpc -I/var/tmp/portage/app-backup/bareos-21.1.5-r2/work/bareos-Release-21.1.5/core/src -I/var/tmp/portage/app-backup/bareos-21.1.5-r2/work/bareos-Release-21.1.5/core/src/fastlz/include  -O2 -march=x86-64 -pipe -pipe -frecord-gcc-switches -fno-diagnostics-color -fmessage-length=0 -Wsuggest-override -Wformat -Wformat-security -fdebug-prefix-map=/var/tmp/portage/app-backup/bareos-21.1.5-r2/work/bareos-Release-21.1.5/core=. -fmacro-prefix-map=/var/tmp/portage/app-backup/bareos-21.1.5-r2/work/bareos-Release-21.1.5/core=. -Wno-unknown-pragmas -Wall -Wno-deprecated-declarations -std=gnu++17 -MD -MT core/src/filed/CMakeFiles/fd_objects.dir/heartbeat.cc.o -MF core/src/filed/CMakeFiles/fd_objects.dir/heartbeat.cc.o.d -o core/src/filed/CMakeFiles/fd_objects.dir/heartbeat.cc.o -c /var/tmp/portage/app-backup/bareos-21.1.5-r2/work/bareos-Release-21.1.5/core/src/filed/heartbeat.cc
[14/362] /usr/bin/x86_64-pc-linux-gnu-g++ -D_FILE_OFFSET_BITS=64 -I/usr/include/tirpc -I/var/tmp/portage/app-backup/bareos-21.1.5-r2/work/bareos-Release-21.1.5/core/src -I/var/tmp/portage/app-backup/bareos-21.1.5-r2/work/bareos-Release-21.1.5/core/src/fastlz/include  -O2 -march=x86-64 -pipe -pipe -frecord-gcc-switches -fno-diagnostics-color -fmessage-length=0 -Wsuggest-override -Wformat -Wformat-security -fdebug-prefix-map=/var/tmp/portage/app-backup/bareos-21.1.5-r2/work/bareos-Release-21.1.5/core=. -fmacro-prefix-map=/var/tmp/portage/app-backup/bareos-21.1.5-r2/work/bareos-Release-21.1.5/core=. -Wno-unknown-pragmas -Wall -Wno-deprecated-declarations -std=gnu++17 -MD -MT core/src/filed/CMakeFiles/fd_objects.dir/fileset.cc.o -MF core/src/filed/CMakeFiles/fd_objects.dir/fileset.cc.o.d -o core/src/filed/CMakeFiles/fd_objects.dir/fileset.cc.o -c /var/tmp/portage/app-backup/bareos-21.1.5-r2/work/bareos-Release-21.1.5/core/src/filed/fileset.cc
[15/362] /usr/bin/x86_64-pc-linux-gnu-g++ -D_FILE_OFFSET_BITS=64 -I/usr/include/tirpc -I/var/tmp/portage/app-backup/bareos-21.1.5-r2/work/bareos-Release-21.1.5/core/src -I/var/tmp/portage/app-backup/bareos-21.1.5-r2/work/bareos-Release-21.1.5/core/src/fastlz/include  -O2 -march=x86-64 -pipe -pipe -frecord-gcc-switches -fno-diagnostics-color -fmessage-length=0 -Wsuggest-override -Wformat -Wformat-security -fdebug-prefix-map=/var/tmp/portage/app-backup/bareos-21.1.5-r2/work/bareos-Release-21.1.5/core=. -fmacro-prefix-map=/var/tmp/portage/app-backup/bareos-21.1.5-r2/work/bareos-Release-21.1.5/core=. -Wno-unknown-pragmas -Wall -Wno-deprecated-declarations -std=gnu++17 -MD -MT core/src/filed/CMakeFiles/fd_objects.dir/backup.cc.o -MF core/src/filed/CMakeFiles/fd_objects.dir/backup.cc.o.d -o core/src/filed/CMakeFiles/fd_objects.dir/backup.cc.o -c /var/tmp/portage/app-backup/bareos-21.1.5-r2/work/bareos-Release-21.1.5/core/src/filed/backup.cc
[16/362] /usr/bin/x86_64-pc-linux-gnu-g++ -D_FILE_OFFSET_BITS=64 -I/usr/include/tirpc -I/var/tmp/portage/app-backup/bareos-21.1.5-r2/work/bareos-Release-21.1.5/core/src -I/var/tmp/portage/app-backup/bareos-21.1.5-r2/work/bareos-Release-21.1.5/core/src/fastlz/include  -O2 -march=x86-64 -pipe -pipe -frecord-gcc-switches -fno-diagnostics-color -fmessage-length=0 -Wsuggest-override -Wformat -Wformat-security -fdebug-prefix-map=/var/tmp/portage/app-backup/bareos-21.1.5-r2/work/bareos-Release-21.1.5/core=. -fmacro-prefix-map=/var/tmp/portage/app-backup/bareos-21.1.5-r2/work/bareos-Release-21.1.5/core=. -Wno-unknown-pragmas -Wall -Wno-deprecated-declarations -std=gnu++17 -MD -MT core/src/filed/CMakeFiles/fd_objects.dir/fd_plugins.cc.o -MF core/src/filed/CMakeFiles/fd_objects.dir/fd_plugins.cc.o.d -o core/src/filed/CMakeFiles/fd_objects.dir/fd_plugins.cc.o -c /var/tmp/portage/app-backup/bareos-21.1.5-r2/work/bareos-Release-21.1.5/core/src/filed/fd_plugins.cc
[17/362] /usr/bin/x86_64-pc-linux-gnu-g++ -D_FILE_OFFSET_BITS=64 -I/usr/include/tirpc -I/var/tmp/portage/app-backup/bareos-21.1.5-r2/work/bareos-Release-21.1.5/core/src -I/var/tmp/portage/app-backup/bareos-21.1.5-r2/work/bareos-Release-21.1.5/core/src/fastlz/include  -O2 -march=x86-64 -pipe -pipe -frecord-gcc-switches -fno-diagnostics-color -fmessage-length=0 -Wsuggest-override -Wformat -Wformat-security -fdebug-prefix-map=/var/tmp/portage/app-backup/bareos-21.1.5-r2/work/bareos-Release-21.1.5/core=. -fmacro-prefix-map=/var/tmp/portage/app-backup/bareos-21.1.5-r2/work/bareos-Release-21.1.5/core=. -Wno-unknown-pragmas -Wall -Wno-deprecated-declarations -std=gnu++17 -MD -MT core/src/filed/CMakeFiles/fd_objects.dir/estimate.cc.o -MF core/src/filed/CMakeFiles/fd_objects.dir/estimate.cc.o.d -o core/src/filed/CMakeFiles/fd_objects.dir/estimate.cc.o -c /var/tmp/portage/app-backup/bareos-21.1.5-r2/work/bareos-Release-21.1.5/core/src/filed/estimate.cc
[18/362] /usr/bin/x86_64-pc-linux-gnu-g++ -D_FILE_OFFSET_BITS=64 -I/usr/include/tirpc -I/var/tmp/portage/app-backup/bareos-21.1.5-r2/work/bareos-Release-21.1.5/core/src  -O2 -march=x86-64 -pipe -pipe -frecord-gcc-switches -fno-diagnostics-color -fmessage-length=0 -Wsuggest-override -Wformat -Wformat-security -fdebug-prefix-map=/var/tmp/portage/app-backup/bareos-21.1.5-r2/work/bareos-Release-21.1.5/core=. -fmacro-prefix-map=/var/tmp/portage/app-backup/bareos-21.1.5-r2/work/bareos-Release-21.1.5/core=. -Wno-unknown-pragmas -Wall -Wno-deprecated-declarations -std=gnu++17 -MD -MT core/src/tools/CMakeFiles/fstype.dir/fstype.cc.o -MF core/src/tools/CMakeFiles/fstype.dir/fstype.cc.o.d -o core/src/tools/CMakeFiles/fstype.dir/fstype.cc.o -c /var/tmp/portage/app-backup/bareos-21.1.5-r2/work/bareos-Release-21.1.5/core/src/tools/fstype.cc
[19/362] /usr/bin/x86_64-pc-linux-gnu-g++ -D_FILE_OFFSET_BITS=64 -I/usr/include/tirpc -I/var/tmp/portage/app-backup/bareos-21.1.5-r2/work/bareos-Release-21.1.5/core/src  -O2 -march=x86-64 -pipe -pipe -frecord-gcc-switches -fno-diagnostics-color -fmessage-length=0 -Wsuggest-override -Wformat -Wformat-security -fdebug-prefix-map=/var/tmp/portage/app-backup/bareos-21.1.5-r2/work/bareos-Release-21.1.5/core=. -fmacro-prefix-map=/var/tmp/portage/app-backup/bareos-21.1.5-r2/work/bareos-Release-21.1.5/core=. -Wno-unknown-pragmas -Wall -Wno-deprecated-declarations -std=gnu++17 -MD -MT core/src/tools/CMakeFiles/drivetype.dir/drivetype.cc.o -MF core/src/tools/CMakeFiles/drivetype.dir/drivetype.cc.o.d -o core/src/tools/CMakeFiles/drivetype.dir/drivetype.cc.o -c /var/tmp/portage/app-backup/bareos-21.1.5-r2/work/bareos-Release-21.1.5/core/src/tools/drivetype.cc
[20/362] /usr/bin/x86_64-pc-linux-gnu-g++ -D_FILE_OFFSET_BITS=64 -I/usr/include/tirpc -I/var/tmp/portage/app-backup/bareos-21.1.5-r2/work/bareos-Release-21.1.5/core/src  -O2 -march=x86-64 -pipe -pipe -frecord-gcc-switches -fno-diagnostics-color -fmessage-length=0 -Wsuggest-override -Wformat -Wformat-security -fdebug-prefix-map=/var/tmp/portage/app-backup/bareos-21.1.5-r2/work/bareos-Release-21.1.5/core=. -fmacro-prefix-map=/var/tmp/portage/app-backup/bareos-21.1.5-r2/work/bareos-Release-21.1.5/core=. -Wno-unknown-pragmas -Wall -Wno-deprecated-declarations -std=gnu++17 -MD -MT core/src/tools/CMakeFiles/bregex.dir/bregex.cc.o -MF core/src/tools/CMakeFiles/bregex.dir/bregex.cc.o.d -o core/src/tools/CMakeFiles/bregex.dir/bregex.cc.o -c /var/tmp/portage/app-backup/bareos-21.1.5-r2/work/bareos-Release-21.1.5/core/src/tools/bregex.cc
[21/362] /usr/bin/x86_64-pc-linux-gnu-g++ -D_FILE_OFFSET_BITS=64 -I/usr/include/tirpc -I/var/tmp/portage/app-backup/bareos-21.1.5-r2/work/bareos-Release-21.1.5/core/src  -O2 -march=x86-64 -pipe -pipe -frecord-gcc-switches -fno-diagnostics-color -fmessage-length=0 -Wsuggest-override -Wformat -Wformat-security -fdebug-prefix-map=/var/tmp/portage/app-backup/bareos-21.1.5-r2/work/bareos-Release-21.1.5/core=. -fmacro-prefix-map=/var/tmp/portage/app-backup/bareos-21.1.5-r2/work/bareos-Release-21.1.5/core=. -Wno-unknown-pragmas -Wall -Wno-deprecated-declarations -std=gnu++17 -MD -MT core/src/tools/CMakeFiles/bwild.dir/bwild.cc.o -MF core/src/tools/CMakeFiles/bwild.dir/bwild.cc.o.d -o core/src/tools/CMakeFiles/bwild.dir/bwild.cc.o -c /var/tmp/portage/app-backup/bareos-21.1.5-r2/work/bareos-Release-21.1.5/core/src/tools/bwild.cc
[22/362] /usr/bin/x86_64-pc-linux-gnu-g++ -D_FILE_OFFSET_BITS=64 -I/usr/include/tirpc -I/var/tmp/portage/app-backup/bareos-21.1.5-r2/work/bareos-Release-21.1.5/core/src  -O2 -march=x86-64 -pipe -pipe -frecord-gcc-switches -fno-diagnostics-color -fmessage-length=0 -Wsuggest-override -Wformat -Wformat-security -fdebug-prefix-map=/var/tmp/portage/app-backup/bareos-21.1.5-r2/work/bareos-Release-21.1.5/core=. -fmacro-prefix-map=/var/tmp/portage/app-backup/bareos-21.1.5-r2/work/bareos-Release-21.1.5/core=. -Wno-unknown-pragmas -Wall -Wno-deprecated-declarations -std=gnu++17 -MD -MT core/src/tools/CMakeFiles/bscrypto.dir/bscrypto.cc.o -MF core/src/tools/CMakeFiles/bscrypto.dir/bscrypto.cc.o.d -o core/src/tools/CMakeFiles/bscrypto.dir/bscrypto.cc.o -c /var/tmp/portage/app-backup/bareos-21.1.5-r2/work/bareos-Release-21.1.5/core/src/tools/bscrypto.cc
[23/362] /usr/bin/x86_64-pc-linux-gnu-g++ -D_FILE_OFFSET_BITS=64 -I/usr/include/tirpc -I/var/tmp/portage/app-backup/bareos-21.1.5-r2/work/bareos-Release-21.1.5/core/src  -O2 -march=x86-64 -pipe -pipe -frecord-gcc-switches -fno-diagnostics-color -fmessage-length=0 -Wsuggest-override -Wformat -Wformat-security -fdebug-prefix-map=/var/tmp/portage/app-backup/bareos-21.1.5-r2/work/bareos-Release-21.1.5/core=. -fmacro-prefix-map=/var/tmp/portage/app-backup/bareos-21.1.5-r2/work/bareos-Release-21.1.5/core=. -Wno-unknown-pragmas -Wall -Wno-deprecated-declarations -std=gnu++17 -MD -MT core/src/tools/CMakeFiles/bsmtp.dir/bsmtp.cc.o -MF core/src/tools/CMakeFiles/bsmtp.dir/bsmtp.cc.o.d -o core/src/tools/CMakeFiles/bsmtp.dir/bsmtp.cc.o -c /var/tmp/portage/app-backup/bareos-21.1.5-r2/work/bareos-Release-21.1.5/core/src/tools/bsmtp.cc
[24/362] /usr/bin/x86_64-pc-linux-gnu-g++ -D_FILE_OFFSET_BITS=64 -I/usr/include/tirpc -I/var/tmp/portage/app-backup/bareos-21.1.5-r2/work/bareos-Release-21.1.5/core/src  -O2 -march=x86-64 -pipe -pipe -frecord-gcc-switches -fno-diagnostics-color -fmessage-length=0 -Wsuggest-override -Wformat -Wformat-security -fdebug-prefix-map=/var/tmp/portage/app-backup/bareos-21.1.5-r2/work/bareos-Release-21.1.5/core=. -fmacro-prefix-map=/var/tmp/portage/app-backup/bareos-21.1.5-r2/work/bareos-Release-21.1.5/core=. -Wno-unknown-pragmas -Wall -Wno-deprecated-declarations -std=gnu++17 -MD -MT core/src/tools/CMakeFiles/bpluginfo.dir/bpluginfo.cc.o -MF core/src/tools/CMakeFiles/bpluginfo.dir/bpluginfo.cc.o.d -o core/src/tools/CMakeFiles/bpluginfo.dir/bpluginfo.cc.o -c /var/tmp/portage/app-backup/bareos-21.1.5-r2/work/bareos-Release-21.1.5/core/src/tools/bpluginfo.cc
[25/362] /usr/bin/x86_64-pc-linux-gnu-g++ -D_FILE_OFFSET_BITS=64 -I/usr/include/tirpc -I/var/tmp/portage/app-backup/bareos-21.1.5-r2/work/bareos-Release-21.1.5/core/src  -O2 -march=x86-64 -pipe -pipe -frecord-gcc-switches -fno-diagnostics-color -fmessage-length=0 -Wsuggest-override -Wformat -Wformat-security -fdebug-prefix-map=/var/tmp/portage/app-backup/bareos-21.1.5-r2/work/bareos-Release-21.1.5/core=. -fmacro-prefix-map=/var/tmp/portage/app-backup/bareos-21.1.5-r2/work/bareos-Release-21.1.5/core=. -Wno-unknown-pragmas -Wall -Wno-deprecated-declarations -std=gnu++17 -MD -MT core/src/tools/CMakeFiles/btestls.dir/btestls.cc.o -MF core/src/tools/CMakeFiles/btestls.dir/btestls.cc.o.d -o core/src/tools/CMakeFiles/btestls.dir/btestls.cc.o -c /var/tmp/portage/app-backup/bareos-21.1.5-r2/work/bareos-Release-21.1.5/core/src/tools/btestls.cc
[26/362] /usr/bin/x86_64-pc-linux-gnu-g++ -D_FILE_OFFSET_BITS=64 -I/usr/include/tirpc -I/var/tmp/portage/app-backup/bareos-21.1.5-r2/work/bareos-Release-21.1.5/core/src  -O2 -march=x86-64 -pipe -pipe -frecord-gcc-switches -fno-diagnostics-color -fmessage-length=0 -Wsuggest-override -Wformat -Wformat-security -fdebug-prefix-map=/var/tmp/portage/app-backup/bareos-21.1.5-r2/work/bareos-Release-21.1.5/core=. -fmacro-prefix-map=/var/tmp/portage/app-backup/bareos-21.1.5-r2/work/bareos-Release-21.1.5/core=. -Wno-unknown-pragmas -Wall -Wno-deprecated-declarations -std=gnu++17 -MD -MT core/src/filed/CMakeFiles/bareos-fd.dir/filed.cc.o -MF core/src/filed/CMakeFiles/bareos-fd.dir/filed.cc.o.d -o core/src/filed/CMakeFiles/bareos-fd.dir/filed.cc.o -c /var/tmp/portage/app-backup/bareos-21.1.5-r2/work/bareos-Release-21.1.5/core/src/filed/filed.cc
[27/362] /usr/bin/x86_64-pc-linux-gnu-g++ -D_FILE_OFFSET_BITS=64 -I/usr/include/tirpc -I/var/tmp/portage/app-backup/bareos-21.1.5-r2/work/bareos-Release-21.1.5/core/src -I/var/tmp/portage/app-backup/bareos-21.1.5-r2/work/bareos-Release-21.1.5/core/src/fastlz/include  -O2 -march=x86-64 -pipe -pipe -frecord-gcc-switches -fno-diagnostics-color -fmessage-length=0 -Wsuggest-override -Wformat -Wformat-security -fdebug-prefix-map=/var/tmp/portage/app-backup/bareos-21.1.5-r2/work/bareos-Release-21.1.5/core=. -fmacro-prefix-map=/var/tmp/portage/app-backup/bareos-21.1.5-r2/work/bareos-Release-21.1.5/core=. -Wno-unknown-pragmas -Wall -Wno-deprecated-declarations -std=gnu++17 -MD -MT core/src/filed/CMakeFiles/fd_objects.dir/dir_cmd.cc.o -MF core/src/filed/CMakeFiles/fd_objects.dir/dir_cmd.cc.o.d -o core/src/filed/CMakeFiles/fd_objects.dir/dir_cmd.cc.o -c /var/tmp/portage/app-backup/bareos-21.1.5-r2/work/bareos-Release-21.1.5/core/src/filed/dir_cmd.cc
[28/362] /usr/bin/x86_64-pc-linux-gnu-g++ -D_FILE_OFFSET_BITS=64 -I/usr/include/tirpc -I/var/tmp/portage/app-backup/bareos-21.1.5-r2/work/bareos-Release-21.1.5/core/src -I/var/tmp/portage/app-backup/bareos-21.1.5-r2/work/bareos-Release-21.1.5/core/src/fastlz/include  -O2 -march=x86-64 -pipe -pipe -frecord-gcc-switches -fno-diagnostics-color -fmessage-length=0 -Wsuggest-override -Wformat -Wformat-security -fdebug-prefix-map=/var/tmp/portage/app-backup/bareos-21.1.5-r2/work/bareos-Release-21.1.5/core=. -fmacro-prefix-map=/var/tmp/portage/app-backup/bareos-21.1.5-r2/work/bareos-Release-21.1.5/core=. -Wno-unknown-pragmas -Wall -Wno-deprecated-declarations -std=gnu++17 -MD -MT core/src/filed/CMakeFiles/fd_objects.dir/status.cc.o -MF core/src/filed/CMakeFiles/fd_objects.dir/status.cc.o.d -o core/src/filed/CMakeFiles/fd_objects.dir/status.cc.o -c /var/tmp/portage/app-backup/bareos-21.1.5-r2/work/bareos-Release-21.1.5/core/src/filed/status.cc
[29/362] /usr/bin/x86_64-pc-linux-gnu-g++ -D_FILE_OFFSET_BITS=64 -I/usr/include/tirpc -I/var/tmp/portage/app-backup/bareos-21.1.5-r2/work/bareos-Release-21.1.5/core/src -I/var/tmp/portage/app-backup/bareos-21.1.5-r2/work/bareos-Release-21.1.5/core/src/fastlz/include  -O2 -march=x86-64 -pipe -pipe -frecord-gcc-switches -fno-diagnostics-color -fmessage-length=0 -Wsuggest-override -Wformat -Wformat-security -fdebug-prefix-map=/var/tmp/portage/app-backup/bareos-21.1.5-r2/work/bareos-Release-21.1.5/core=. -fmacro-prefix-map=/var/tmp/portage/app-backup/bareos-21.1.5-r2/work/bareos-Release-21.1.5/core=. -Wno-unknown-pragmas -Wall -Wno-deprecated-declarations -std=gnu++17 -MD -MT core/src/filed/CMakeFiles/fd_objects.dir/restore.cc.o -MF core/src/filed/CMakeFiles/fd_objects.dir/restore.cc.o.d -o core/src/filed/CMakeFiles/fd_objects.dir/restore.cc.o -c /var/tmp/portage/app-backup/bareos-21.1.5-r2/work/bareos-Release-21.1.5/core/src/filed/restore.cc
[30/362] /usr/bin/x86_64-pc-linux-gnu-g++ -D_BDB_PRIV_INTERFACE_ -D_FILE_OFFSET_BITS=64 -Dbareossql_EXPORTS -I/usr/include/tirpc -I/var/tmp/portage/app-backup/bareos-21.1.5-r2/work/bareos-Release-21.1.5/core/src -I/usr/include/postgresql  -O2 -march=x86-64 -pipe -pipe -frecord-gcc-switches -fno-diagnostics-color -fmessage-length=0 -Wsuggest-override -Wformat -Wformat-security -fdebug-prefix-map=/var/tmp/portage/app-backup/bareos-21.1.5-r2/work/bareos-Release-21.1.5/core=. -fmacro-prefix-map=/var/tmp/portage/app-backup/bareos-21.1.5-r2/work/bareos-Release-21.1.5/core=. -Wno-unknown-pragmas -Wall -fPIC -Wno-deprecated-declarations -std=gnu++17 -MD -MT core/src/cats/CMakeFiles/bareossql.dir/bvfs.cc.o -MF core/src/cats/CMakeFiles/bareossql.dir/bvfs.cc.o.d -o core/src/cats/CMakeFiles/bareossql.dir/bvfs.cc.o -c /var/tmp/portage/app-backup/bareos-21.1.5-r2/work/bareos-Release-21.1.5/core/src/cats/bvfs.cc
FAILED: core/src/cats/CMakeFiles/bareossql.dir/bvfs.cc.o 
/usr/bin/x86_64-pc-linux-gnu-g++ -D_BDB_PRIV_INTERFACE_ -D_FILE_OFFSET_BITS=64 -Dbareossql_EXPORTS -I/usr/include/tirpc -I/var/tmp/portage/app-backup/bareos-21.1.5-r2/work/bareos-Release-21.1.5/core/src -I/usr/include/postgresql  -O2 -march=x86-64 -pipe -pipe -frecord-gcc-switches -fno-diagnostics-color -fmessage-length=0 -Wsuggest-override -Wformat -Wformat-security -fdebug-prefix-map=/var/tmp/portage/app-backup/bareos-21.1.5-r2/work/bareos-Release-21.1.5/core=. -fmacro-prefix-map=/var/tmp/portage/app-backup/bareos-21.1.5-r2/work/bareos-Release-21.1.5/core=. -Wno-unknown-pragmas -Wall -fPIC -Wno-deprecated-declarations -std=gnu++17 -MD -MT core/src/cats/CMakeFiles/bareossql.dir/bvfs.cc.o -MF core/src/cats/CMakeFiles/bareossql.dir/bvfs.cc.o.d -o core/src/cats/CMakeFiles/bareossql.dir/bvfs.cc.o -c /var/tmp/portage/app-backup/bareos-21.1.5-r2/work/bareos-Release-21.1.5/core/src/cats/bvfs.cc
In file included from /var/tmp/portage/app-backup/bareos-21.1.5-r2/work/bareos-Release-21.1.5/core/src/cats/bvfs.cc:31:
/var/tmp/portage/app-backup/bareos-21.1.5-r2/work/bareos-Release-21.1.5/core/src/cats/cats.h:491:50: error: expected class-name before ‘{’ token
  491 | class BareosSqlError : public std::runtime_error {
      |                                                  ^
/var/tmp/portage/app-backup/bareos-21.1.5-r2/work/bareos-Release-21.1.5/core/src/cats/cats.h: In constructor ‘BareosSqlError::BareosSqlError(const char*)’:
/var/tmp/portage/app-backup/bareos-21.1.5-r2/work/bareos-Release-21.1.5/core/src/cats/cats.h:493:56: error: expected class-name before ‘(’ token
  493 |   BareosSqlError(const char* what) : std::runtime_error(what) {}
      |                                                        ^
/var/tmp/portage/app-backup/bareos-21.1.5-r2/work/bareos-Release-21.1.5/core/src/cats/cats.h:493:56: error: expected ‘{’ before ‘(’ token
[31/362] /usr/bin/x86_64-pc-linux-gnu-g++ -D_FILE_OFFSET_BITS=64 -I/usr/include/tirpc -I/var/tmp/portage/app-backup/bareos-21.1.5-r2/work/bareos-Release-21.1.5/core/src -I/var/tmp/portage/app-backup/bareos-21.1.5-r2/work/bareos-Release-21.1.5/core/src/fastlz/include  -O2 -march=x86-64 -pipe -pipe -frecord-gcc-switches -fno-diagnostics-color -fmessage-length=0 -Wsuggest-override -Wformat -Wformat-security -fdebug-prefix-map=/var/tmp/portage/app-backup/bareos-21.1.5-r2/work/bareos-Release-21.1.5/core=. -fmacro-prefix-map=/var/tmp/portage/app-backup/bareos-21.1.5-r2/work/bareos-Release-21.1.5/core=. -Wno-unknown-pragmas -Wall -Wno-deprecated-declarations -std=gnu++17 -MD -MT core/src/filed/CMakeFiles/fd_objects.dir/filed_conf.cc.o -MF core/src/filed/CMakeFiles/fd_objects.dir/filed_conf.cc.o.d -o core/src/filed/CMakeFiles/fd_objects.dir/filed_conf.cc.o -c /var/tmp/portage/app-backup/bareos-21.1.5-r2/work/bareos-Release-21.1.5/core/src/filed/filed_conf.cc
[32/362] /usr/bin/x86_64-pc-linux-gnu-g++ -D_BDB_PRIV_INTERFACE_ -D_FILE_OFFSET_BITS=64 -Dbareossql_EXPORTS -I/usr/include/tirpc -I/var/tmp/portage/app-backup/bareos-21.1.5-r2/work/bareos-Release-21.1.5/core/src -I/usr/include/postgresql  -O2 -march=x86-64 -pipe -pipe -frecord-gcc-switches -fno-diagnostics-color -fmessage-length=0 -Wsuggest-override -Wformat -Wformat-security -fdebug-prefix-map=/var/tmp/portage/app-backup/bareos-21.1.5-r2/work/bareos-Release-21.1.5/core=. -fmacro-prefix-map=/var/tmp/portage/app-backup/bareos-21.1.5-r2/work/bareos-Release-21.1.5/core=. -Wno-unknown-pragmas -Wall -fPIC -Wno-deprecated-declarations -std=gnu++17 -MD -MT core/src/cats/CMakeFiles/bareossql.dir/cats.cc.o -MF core/src/cats/CMakeFiles/bareossql.dir/cats.cc.o.d -o core/src/cats/CMakeFiles/bareossql.dir/cats.cc.o -c /var/tmp/portage/app-backup/bareos-21.1.5-r2/work/bareos-Release-21.1.5/core/src/cats/cats.cc
FAILED: core/src/cats/CMakeFiles/bareossql.dir/cats.cc.o 
/usr/bin/x86_64-pc-linux-gnu-g++ -D_BDB_PRIV_INTERFACE_ -D_FILE_OFFSET_BITS=64 -Dbareossql_EXPORTS -I/usr/include/tirpc -I/var/tmp/portage/app-backup/bareos-21.1.5-r2/work/bareos-Release-21.1.5/core/src -I/usr/include/postgresql  -O2 -march=x86-64 -pipe -pipe -frecord-gcc-switches -fno-diagnostics-color -fmessage-length=0 -Wsuggest-override -Wformat -Wformat-security -fdebug-prefix-map=/var/tmp/portage/app-backup/bareos-21.1.5-r2/work/bareos-Release-21.1.5/core=. -fmacro-prefix-map=/var/tmp/portage/app-backup/bareos-21.1.5-r2/work/bareos-Release-21.1.5/core=. -Wno-unknown-pragmas -Wall -fPIC -Wno-deprecated-declarations -std=gnu++17 -MD -MT core/src/cats/CMakeFiles/bareossql.dir/cats.cc.o -MF core/src/cats/CMakeFiles/bareossql.dir/cats.cc.o.d -o core/src/cats/CMakeFiles/bareossql.dir/cats.cc.o -c /var/tmp/portage/app-backup/bareos-21.1.5-r2/work/bareos-Release-21.1.5/core/src/cats/cats.cc
In file included from /var/tmp/portage/app-backup/bareos-21.1.5-r2/work/bareos-Release-21.1.5/core/src/cats/cats.cc:33:
/var/tmp/portage/app-backup/bareos-21.1.5-r2/work/bareos-Release-21.1.5/core/src/cats/cats.h:491:50: error: expected class-name before ‘{’ token
  491 | class BareosSqlError : public std::runtime_error {
      |                                                  ^
/var/tmp/portage/app-backup/bareos-21.1.5-r2/work/bareos-Release-21.1.5/core/src/cats/cats.h: In constructor ‘BareosSqlError::BareosSqlError(const char*)’:
/var/tmp/portage/app-backup/bareos-21.1.5-r2/work/bareos-Release-21.1.5/core/src/cats/cats.h:493:56: error: expected class-name before ‘(’ token
  493 |   BareosSqlError(const char* what) : std::runtime_error(what) {}
      |                                                        ^
/var/tmp/portage/app-backup/bareos-21.1.5-r2/work/bareos-Release-21.1.5/core/src/cats/cats.h:493:56: error: expected ‘{’ before ‘(’ token
[33/362] /usr/bin/x86_64-pc-linux-gnu-g++ -D_BDB_PRIV_INTERFACE_ -D_FILE_OFFSET_BITS=64 -Dbareossql_EXPORTS -I/usr/include/tirpc -I/var/tmp/portage/app-backup/bareos-21.1.5-r2/work/bareos-Release-21.1.5/core/src -I/usr/include/postgresql  -O2 -march=x86-64 -pipe -pipe -frecord-gcc-switches -fno-diagnostics-color -fmessage-length=0 -Wsuggest-override -Wformat -Wformat-security -fdebug-prefix-map=/var/tmp/portage/app-backup/bareos-21.1.5-r2/work/bareos-Release-21.1.5/core=. -fmacro-prefix-map=/var/tmp/portage/app-backup/bareos-21.1.5-r2/work/bareos-Release-21.1.5/core=. -Wno-unknown-pragmas -Wall -fPIC -Wno-deprecated-declarations -std=gnu++17 -MD -MT core/src/cats/CMakeFiles/bareossql.dir/sql.cc.o -MF core/src/cats/CMakeFiles/bareossql.dir/sql.cc.o.d -o core/src/cats/CMakeFiles/bareossql.dir/sql.cc.o -c /var/tmp/portage/app-backup/bareos-21.1.5-r2/work/bareos-Release-21.1.5/core/src/cats/sql.cc
FAILED: core/src/cats/CMakeFiles/bareossql.dir/sql.cc.o 
/usr/bin/x86_64-pc-linux-gnu-g++ -D_BDB_PRIV_INTERFACE_ -D_FILE_OFFSET_BITS=64 -Dbareossql_EXPORTS -I/usr/include/tirpc -I/var/tmp/portage/app-backup/bareos-21.1.5-r2/work/bareos-Release-21.1.5/core/src -I/usr/include/postgresql  -O2 -march=x86-64 -pipe -pipe -frecord-gcc-switches -fno-diagnostics-color -fmessage-length=0 -Wsuggest-override -Wformat -Wformat-security -fdebug-prefix-map=/var/tmp/portage/app-backup/bareos-21.1.5-r2/work/bareos-Release-21.1.5/core=. -fmacro-prefix-map=/var/tmp/portage/app-backup/bareos-21.1.5-r2/work/bareos-Release-21.1.5/core=. -Wno-unknown-pragmas -Wall -fPIC -Wno-deprecated-declarations -std=gnu++17 -MD -MT core/src/cats/CMakeFiles/bareossql.dir/sql.cc.o -MF core/src/cats/CMakeFiles/bareossql.dir/sql.cc.o.d -o core/src/cats/CMakeFiles/bareossql.dir/sql.cc.o -c /var/tmp/portage/app-backup/bareos-21.1.5-r2/work/bareos-Release-21.1.5/core/src/cats/sql.cc
In file included from /var/tmp/portage/app-backup/bareos-21.1.5-r2/work/bareos-Release-21.1.5/core/src/cats/sql.cc:37:
/var/tmp/portage/app-backup/bareos-21.1.5-r2/work/bareos-Release-21.1.5/core/src/cats/cats.h:491:50: error: expected class-name before ‘{’ token
  491 | class BareosSqlError : public std::runtime_error {
      |                                                  ^
/var/tmp/portage/app-backup/bareos-21.1.5-r2/work/bareos-Release-21.1.5/core/src/cats/cats.h: In constructor ‘BareosSqlError::BareosSqlError(const char*)’:
/var/tmp/portage/app-backup/bareos-21.1.5-r2/work/bareos-Release-21.1.5/core/src/cats/cats.h:493:56: error: expected class-name before ‘(’ token
  493 |   BareosSqlError(const char* what) : std::runtime_error(what) {}
      |                                                        ^
/var/tmp/portage/app-backup/bareos-21.1.5-r2/work/bareos-Release-21.1.5/core/src/cats/cats.h:493:56: error: expected ‘{’ before ‘(’ token
[34/362] /usr/bin/x86_64-pc-linux-gnu-g++ -D_BDB_PRIV_INTERFACE_ -D_FILE_OFFSET_BITS=64 -Dbareossql_EXPORTS -I/usr/include/tirpc -I/var/tmp/portage/app-backup/bareos-21.1.5-r2/work/bareos-Release-21.1.5/core/src -I/usr/include/postgresql  -O2 -march=x86-64 -pipe -pipe -frecord-gcc-switches -fno-diagnostics-color -fmessage-length=0 -Wsuggest-override -Wformat -Wformat-security -fdebug-prefix-map=/var/tmp/portage/app-backup/bareos-21.1.5-r2/work/bareos-Release-21.1.5/core=. -fmacro-prefix-map=/var/tmp/portage/app-backup/bareos-21.1.5-r2/work/bareos-Release-21.1.5/core=. -Wno-unknown-pragmas -Wall -fPIC -Wno-deprecated-declarations -std=gnu++17 -MD -MT core/src/cats/CMakeFiles/bareossql.dir/sql_delete.cc.o -MF core/src/cats/CMakeFiles/bareossql.dir/sql_delete.cc.o.d -o core/src/cats/CMakeFiles/bareossql.dir/sql_delete.cc.o -c /var/tmp/portage/app-backup/bareos-21.1.5-r2/work/bareos-Release-21.1.5/core/src/cats/sql_delete.cc
FAILED: core/src/cats/CMakeFiles/bareossql.dir/sql_delete.cc.o 
/usr/bin/x86_64-pc-linux-gnu-g++ -D_BDB_PRIV_INTERFACE_ -D_FILE_OFFSET_BITS=64 -Dbareossql_EXPORTS -I/usr/include/tirpc -I/var/tmp/portage/app-backup/bareos-21.1.5-r2/work/bareos-Release-21.1.5/core/src -I/usr/include/postgresql  -O2 -march=x86-64 -pipe -pipe -frecord-gcc-switches -fno-diagnostics-color -fmessage-length=0 -Wsuggest-override -Wformat -Wformat-security -fdebug-prefix-map=/var/tmp/portage/app-backup/bareos-21.1.5-r2/work/bareos-Release-21.1.5/core=. -fmacro-prefix-map=/var/tmp/portage/app-backup/bareos-21.1.5-r2/work/bareos-Release-21.1.5/core=. -Wno-unknown-pragmas -Wall -fPIC -Wno-deprecated-declarations -std=gnu++17 -MD -MT core/src/cats/CMakeFiles/bareossql.dir/sql_delete.cc.o -MF core/src/cats/CMakeFiles/bareossql.dir/sql_delete.cc.o.d -o core/src/cats/CMakeFiles/bareossql.dir/sql_delete.cc.o -c /var/tmp/portage/app-backup/bareos-21.1.5-r2/work/bareos-Release-21.1.5/core/src/cats/sql_delete.cc
In file included from /var/tmp/portage/app-backup/bareos-21.1.5-r2/work/bareos-Release-21.1.5/core/src/cats/sql_delete.cc:33:
/var/tmp/portage/app-backup/bareos-21.1.5-r2/work/bareos-Release-21.1.5/core/src/cats/cats.h:491:50: error: expected class-name before ‘{’ token
  491 | class BareosSqlError : public std::runtime_error {
      |                                                  ^
/var/tmp/portage/app-backup/bareos-21.1.5-r2/work/bareos-Release-21.1.5/core/src/cats/cats.h: In constructor ‘BareosSqlError::BareosSqlError(const char*)’:
/var/tmp/portage/app-backup/bareos-21.1.5-r2/work/bareos-Release-21.1.5/core/src/cats/cats.h:493:56: error: expected class-name before ‘(’ token
  493 |   BareosSqlError(const char* what) : std::runtime_error(what) {}
      |                                                        ^
/var/tmp/portage/app-backup/bareos-21.1.5-r2/work/bareos-Release-21.1.5/core/src/cats/cats.h:493:56: error: expected ‘{’ before ‘(’ token
[35/362] /usr/bin/x86_64-pc-linux-gnu-g++ -D_BDB_PRIV_INTERFACE_ -D_FILE_OFFSET_BITS=64 -Dbareossql_EXPORTS -I/usr/include/tirpc -I/var/tmp/portage/app-backup/bareos-21.1.5-r2/work/bareos-Release-21.1.5/core/src -I/usr/include/postgresql  -O2 -march=x86-64 -pipe -pipe -frecord-gcc-switches -fno-diagnostics-color -fmessage-length=0 -Wsuggest-override -Wformat -Wformat-security -fdebug-prefix-map=/var/tmp/portage/app-backup/bareos-21.1.5-r2/work/bareos-Release-21.1.5/core=. -fmacro-prefix-map=/var/tmp/portage/app-backup/bareos-21.1.5-r2/work/bareos-Release-21.1.5/core=. -Wno-unknown-pragmas -Wall -fPIC -Wno-deprecated-declarations -std=gnu++17 -MD -MT core/src/cats/CMakeFiles/bareossql.dir/sql_create.cc.o -MF core/src/cats/CMakeFiles/bareossql.dir/sql_create.cc.o.d -o core/src/cats/CMakeFiles/bareossql.dir/sql_create.cc.o -c /var/tmp/portage/app-backup/bareos-21.1.5-r2/work/bareos-Release-21.1.5/core/src/cats/sql_create.cc
FAILED: core/src/cats/CMakeFiles/bareossql.dir/sql_create.cc.o 
/usr/bin/x86_64-pc-linux-gnu-g++ -D_BDB_PRIV_INTERFACE_ -D_FILE_OFFSET_BITS=64 -Dbareossql_EXPORTS -I/usr/include/tirpc -I/var/tmp/portage/app-backup/bareos-21.1.5-r2/work/bareos-Release-21.1.5/core/src -I/usr/include/postgresql  -O2 -march=x86-64 -pipe -pipe -frecord-gcc-switches -fno-diagnostics-color -fmessage-length=0 -Wsuggest-override -Wformat -Wformat-security -fdebug-prefix-map=/var/tmp/portage/app-backup/bareos-21.1.5-r2/work/bareos-Release-21.1.5/core=. -fmacro-prefix-map=/var/tmp/portage/app-backup/bareos-21.1.5-r2/work/bareos-Release-21.1.5/core=. -Wno-unknown-pragmas -Wall -fPIC -Wno-deprecated-declarations -std=gnu++17 -MD -MT core/src/cats/CMakeFiles/bareossql.dir/sql_create.cc.o -MF core/src/cats/CMakeFiles/bareossql.dir/sql_create.cc.o.d -o core/src/cats/CMakeFiles/bareossql.dir/sql_create.cc.o -c /var/tmp/portage/app-backup/bareos-21.1.5-r2/work/bareos-Release-21.1.5/core/src/cats/sql_create.cc
In file included from /var/tmp/portage/app-backup/bareos-21.1.5-r2/work/bareos-Release-21.1.5/core/src/cats/sql_create.cc:35:
/var/tmp/portage/app-backup/bareos-21.1.5-r2/work/bareos-Release-21.1.5/core/src/cats/cats.h:491:50: error: expected class-name before ‘{’ token
  491 | class BareosSqlError : public std::runtime_error {
      |                                                  ^
/var/tmp/portage/app-backup/bareos-21.1.5-r2/work/bareos-Release-21.1.5/core/src/cats/cats.h: In constructor ‘BareosSqlError::BareosSqlError(const char*)’:
/var/tmp/portage/app-backup/bareos-21.1.5-r2/work/bareos-Release-21.1.5/core/src/cats/cats.h:493:56: error: expected class-name before ‘(’ token
  493 |   BareosSqlError(const char* what) : std::runtime_error(what) {}
      |                                                        ^
/var/tmp/portage/app-backup/bareos-21.1.5-r2/work/bareos-Release-21.1.5/core/src/cats/cats.h:493:56: error: expected ‘{’ before ‘(’ token
[36/362] /usr/bin/x86_64-pc-linux-gnu-g++ -D_BDB_PRIV_INTERFACE_ -D_FILE_OFFSET_BITS=64 -Dbareossql_EXPORTS -I/usr/include/tirpc -I/var/tmp/portage/app-backup/bareos-21.1.5-r2/work/bareos-Release-21.1.5/core/src -I/usr/include/postgresql  -O2 -march=x86-64 -pipe -pipe -frecord-gcc-switches -fno-diagnostics-color -fmessage-length=0 -Wsuggest-override -Wformat -Wformat-security -fdebug-prefix-map=/var/tmp/portage/app-backup/bareos-21.1.5-r2/work/bareos-Release-21.1.5/core=. -fmacro-prefix-map=/var/tmp/portage/app-backup/bareos-21.1.5-r2/work/bareos-Release-21.1.5/core=. -Wno-unknown-pragmas -Wall -fPIC -Wno-deprecated-declarations -std=gnu++17 -MD -MT core/src/cats/CMakeFiles/bareossql.dir/sql_find.cc.o -MF core/src/cats/CMakeFiles/bareossql.dir/sql_find.cc.o.d -o core/src/cats/CMakeFiles/bareossql.dir/sql_find.cc.o -c /var/tmp/portage/app-backup/bareos-21.1.5-r2/work/bareos-Release-21.1.5/core/src/cats/sql_find.cc
FAILED: core/src/cats/CMakeFiles/bareossql.dir/sql_find.cc.o 
/usr/bin/x86_64-pc-linux-gnu-g++ -D_BDB_PRIV_INTERFACE_ -D_FILE_OFFSET_BITS=64 -Dbareossql_EXPORTS -I/usr/include/tirpc -I/var/tmp/portage/app-backup/bareos-21.1.5-r2/work/bareos-Release-21.1.5/core/src -I/usr/include/postgresql  -O2 -march=x86-64 -pipe -pipe -frecord-gcc-switches -fno-diagnostics-color -fmessage-length=0 -Wsuggest-override -Wformat -Wformat-security -fdebug-prefix-map=/var/tmp/portage/app-backup/bareos-21.1.5-r2/work/bareos-Release-21.1.5/core=. -fmacro-prefix-map=/var/tmp/portage/app-backup/bareos-21.1.5-r2/work/bareos-Release-21.1.5/core=. -Wno-unknown-pragmas -Wall -fPIC -Wno-deprecated-declarations -std=gnu++17 -MD -MT core/src/cats/CMakeFiles/bareossql.dir/sql_find.cc.o -MF core/src/cats/CMakeFiles/bareossql.dir/sql_find.cc.o.d -o core/src/cats/CMakeFiles/bareossql.dir/sql_find.cc.o -c /var/tmp/portage/app-backup/bareos-21.1.5-r2/work/bareos-Release-21.1.5/core/src/cats/sql_find.cc
In file included from /var/tmp/portage/app-backup/bareos-21.1.5-r2/work/bareos-Release-21.1.5/core/src/cats/sql_find.cc:37:
/var/tmp/portage/app-backup/bareos-21.1.5-r2/work/bareos-Release-21.1.5/core/src/cats/cats.h:491:50: error: expected class-name before ‘{’ token
  491 | class BareosSqlError : public std::runtime_error {
      |                                                  ^
/var/tmp/portage/app-backup/bareos-21.1.5-r2/work/bareos-Release-21.1.5/core/src/cats/cats.h: In constructor ‘BareosSqlError::BareosSqlError(const char*)’:
/var/tmp/portage/app-backup/bareos-21.1.5-r2/work/bareos-Release-21.1.5/core/src/cats/cats.h:493:56: error: expected class-name before ‘(’ token
  493 |   BareosSqlError(const char* what) : std::runtime_error(what) {}
      |                                                        ^
/var/tmp/portage/app-backup/bareos-21.1.5-r2/work/bareos-Release-21.1.5/core/src/cats/cats.h:493:56: error: expected ‘{’ before ‘(’ token
[37/362] /usr/bin/x86_64-pc-linux-gnu-g++ -D_BDB_PRIV_INTERFACE_ -D_FILE_OFFSET_BITS=64 -Dbareossql_EXPORTS -I/usr/include/tirpc -I/var/tmp/portage/app-backup/bareos-21.1.5-r2/work/bareos-Release-21.1.5/core/src -I/usr/include/postgresql  -O2 -march=x86-64 -pipe -pipe -frecord-gcc-switches -fno-diagnostics-color -fmessage-length=0 -Wsuggest-override -Wformat -Wformat-security -fdebug-prefix-map=/var/tmp/portage/app-backup/bareos-21.1.5-r2/work/bareos-Release-21.1.5/core=. -fmacro-prefix-map=/var/tmp/portage/app-backup/bareos-21.1.5-r2/work/bareos-Release-21.1.5/core=. -Wno-unknown-pragmas -Wall -fPIC -Wno-deprecated-declarations -std=gnu++17 -MD -MT core/src/cats/CMakeFiles/bareossql.dir/sql_get.cc.o -MF core/src/cats/CMakeFiles/bareossql.dir/sql_get.cc.o.d -o core/src/cats/CMakeFiles/bareossql.dir/sql_get.cc.o -c /var/tmp/portage/app-backup/bareos-21.1.5-r2/work/bareos-Release-21.1.5/core/src/cats/sql_get.cc
FAILED: core/src/cats/CMakeFiles/bareossql.dir/sql_get.cc.o 
/usr/bin/x86_64-pc-linux-gnu-g++ -D_BDB_PRIV_INTERFACE_ -D_FILE_OFFSET_BITS=64 -Dbareossql_EXPORTS -I/usr/include/tirpc -I/var/tmp/portage/app-backup/bareos-21.1.5-r2/work/bareos-Release-21.1.5/core/src -I/usr/include/postgresql  -O2 -march=x86-64 -pipe -pipe -frecord-gcc-switches -fno-diagnostics-color -fmessage-length=0 -Wsuggest-override -Wformat -Wformat-security -fdebug-prefix-map=/var/tmp/portage/app-backup/bareos-21.1.5-r2/work/bareos-Release-21.1.5/core=. -fmacro-prefix-map=/var/tmp/portage/app-backup/bareos-21.1.5-r2/work/bareos-Release-21.1.5/core=. -Wno-unknown-pragmas -Wall -fPIC -Wno-deprecated-declarations -std=gnu++17 -MD -MT core/src/cats/CMakeFiles/bareossql.dir/sql_get.cc.o -MF core/src/cats/CMakeFiles/bareossql.dir/sql_get.cc.o.d -o core/src/cats/CMakeFiles/bareossql.dir/sql_get.cc.o -c /var/tmp/portage/app-backup/bareos-21.1.5-r2/work/bareos-Release-21.1.5/core/src/cats/sql_get.cc
In file included from /var/tmp/portage/app-backup/bareos-21.1.5-r2/work/bareos-Release-21.1.5/core/src/cats/sql_get.cc:38:
/var/tmp/portage/app-backup/bareos-21.1.5-r2/work/bareos-Release-21.1.5/core/src/cats/cats.h:491:50: error: expected class-name before ‘{’ token
  491 | class BareosSqlError : public std::runtime_error {
      |                                                  ^
/var/tmp/portage/app-backup/bareos-21.1.5-r2/work/bareos-Release-21.1.5/core/src/cats/cats.h: In constructor ‘BareosSqlError::BareosSqlError(const char*)’:
/var/tmp/portage/app-backup/bareos-21.1.5-r2/work/bareos-Release-21.1.5/core/src/cats/cats.h:493:56: error: expected class-name before ‘(’ token
  493 |   BareosSqlError(const char* what) : std::runtime_error(what) {}
      |                                                        ^
/var/tmp/portage/app-backup/bareos-21.1.5-r2/work/bareos-Release-21.1.5/core/src/cats/cats.h:493:56: error: expected ‘{’ before ‘(’ token
[38/362] /usr/bin/x86_64-pc-linux-gnu-g++ -D_BDB_PRIV_INTERFACE_ -D_FILE_OFFSET_BITS=64 -Dbareossql_EXPORTS -I/usr/include/tirpc -I/var/tmp/portage/app-backup/bareos-21.1.5-r2/work/bareos-Release-21.1.5/core/src -I/usr/include/postgresql  -O2 -march=x86-64 -pipe -pipe -frecord-gcc-switches -fno-diagnostics-color -fmessage-length=0 -Wsuggest-override -Wformat -Wformat-security -fdebug-prefix-map=/var/tmp/portage/app-backup/bareos-21.1.5-r2/work/bareos-Release-21.1.5/core=. -fmacro-prefix-map=/var/tmp/portage/app-backup/bareos-21.1.5-r2/work/bareos-Release-21.1.5/core=. -Wno-unknown-pragmas -Wall -fPIC -Wno-deprecated-declarations -std=gnu++17 -MD -MT core/src/cats/CMakeFiles/bareossql.dir/sql_list.cc.o -MF core/src/cats/CMakeFiles/bareossql.dir/sql_list.cc.o.d -o core/src/cats/CMakeFiles/bareossql.dir/sql_list.cc.o -c /var/tmp/portage/app-backup/bareos-21.1.5-r2/work/bareos-Release-21.1.5/core/src/cats/sql_list.cc
FAILED: core/src/cats/CMakeFiles/bareossql.dir/sql_list.cc.o 
/usr/bin/x86_64-pc-linux-gnu-g++ -D_BDB_PRIV_INTERFACE_ -D_FILE_OFFSET_BITS=64 -Dbareossql_EXPORTS -I/usr/include/tirpc -I/var/tmp/portage/app-backup/bareos-21.1.5-r2/work/bareos-Release-21.1.5/core/src -I/usr/include/postgresql  -O2 -march=x86-64 -pipe -pipe -frecord-gcc-switches -fno-diagnostics-color -fmessage-length=0 -Wsuggest-override -Wformat -Wformat-security -fdebug-prefix-map=/var/tmp/portage/app-backup/bareos-21.1.5-r2/work/bareos-Release-21.1.5/core=. -fmacro-prefix-map=/var/tmp/portage/app-backup/bareos-21.1.5-r2/work/bareos-Release-21.1.5/core=. -Wno-unknown-pragmas -Wall -fPIC -Wno-deprecated-declarations -std=gnu++17 -MD -MT core/src/cats/CMakeFiles/bareossql.dir/sql_list.cc.o -MF core/src/cats/CMakeFiles/bareossql.dir/sql_list.cc.o.d -o core/src/cats/CMakeFiles/bareossql.dir/sql_list.cc.o -c /var/tmp/portage/app-backup/bareos-21.1.5-r2/work/bareos-Release-21.1.5/core/src/cats/sql_list.cc
In file included from /var/tmp/portage/app-backup/bareos-21.1.5-r2/work/bareos-Release-21.1.5/core/src/cats/sql_list.cc:33:
/var/tmp/portage/app-backup/bareos-21.1.5-r2/work/bareos-Release-21.1.5/core/src/cats/cats.h:491:50: error: expected class-name before ‘{’ token
  491 | class BareosSqlError : public std::runtime_error {
      |                                                  ^
/var/tmp/portage/app-backup/bareos-21.1.5-r2/work/bareos-Release-21.1.5/core/src/cats/cats.h: In constructor ‘BareosSqlError::BareosSqlError(const char*)’:
/var/tmp/portage/app-backup/bareos-21.1.5-r2/work/bareos-Release-21.1.5/core/src/cats/cats.h:493:56: error: expected class-name before ‘(’ token
  493 |   BareosSqlError(const char* what) : std::runtime_error(what) {}
      |                                                        ^
/var/tmp/portage/app-backup/bareos-21.1.5-r2/work/bareos-Release-21.1.5/core/src/cats/cats.h:493:56: error: expected ‘{’ before ‘(’ token
[39/362] /usr/bin/x86_64-pc-linux-gnu-g++ -D_BDB_PRIV_INTERFACE_ -D_FILE_OFFSET_BITS=64 -Dbareossql_EXPORTS -I/usr/include/tirpc -I/var/tmp/portage/app-backup/bareos-21.1.5-r2/work/bareos-Release-21.1.5/core/src -I/usr/include/postgresql  -O2 -march=x86-64 -pipe -pipe -frecord-gcc-switches -fno-diagnostics-color -fmessage-length=0 -Wsuggest-override -Wformat -Wformat-security -fdebug-prefix-map=/var/tmp/portage/app-backup/bareos-21.1.5-r2/work/bareos-Release-21.1.5/core=. -fmacro-prefix-map=/var/tmp/portage/app-backup/bareos-21.1.5-r2/work/bareos-Release-21.1.5/core=. -Wno-unknown-pragmas -Wall -fPIC -Wno-deprecated-declarations -std=gnu++17 -MD -MT core/src/cats/CMakeFiles/bareossql.dir/sql_query.cc.o -MF core/src/cats/CMakeFiles/bareossql.dir/sql_query.cc.o.d -o core/src/cats/CMakeFiles/bareossql.dir/sql_query.cc.o -c /var/tmp/portage/app-backup/bareos-21.1.5-r2/work/bareos-Release-21.1.5/core/src/cats/sql_query.cc
FAILED: core/src/cats/CMakeFiles/bareossql.dir/sql_query.cc.o 
/usr/bin/x86_64-pc-linux-gnu-g++ -D_BDB_PRIV_INTERFACE_ -D_FILE_OFFSET_BITS=64 -Dbareossql_EXPORTS -I/usr/include/tirpc -I/var/tmp/portage/app-backup/bareos-21.1.5-r2/work/bareos-Release-21.1.5/core/src -I/usr/include/postgresql  -O2 -march=x86-64 -pipe -pipe -frecord-gcc-switches -fno-diagnostics-color -fmessage-length=0 -Wsuggest-override -Wformat -Wformat-security -fdebug-prefix-map=/var/tmp/portage/app-backup/bareos-21.1.5-r2/work/bareos-Release-21.1.5/core=. -fmacro-prefix-map=/var/tmp/portage/app-backup/bareos-21.1.5-r2/work/bareos-Release-21.1.5/core=. -Wno-unknown-pragmas -Wall -fPIC -Wno-deprecated-declarations -std=gnu++17 -MD -MT core/src/cats/CMakeFiles/bareossql.dir/sql_query.cc.o -MF core/src/cats/CMakeFiles/bareossql.dir/sql_query.cc.o.d -o core/src/cats/CMakeFiles/bareossql.dir/sql_query.cc.o -c /var/tmp/portage/app-backup/bareos-21.1.5-r2/work/bareos-Release-21.1.5/core/src/cats/sql_query.cc
In file included from /var/tmp/portage/app-backup/bareos-21.1.5-r2/work/bareos-Release-21.1.5/core/src/cats/sql_query.cc:32:
/var/tmp/portage/app-backup/bareos-21.1.5-r2/work/bareos-Release-21.1.5/core/src/cats/cats.h:491:50: error: expected class-name before ‘{’ token
  491 | class BareosSqlError : public std::runtime_error {
      |                                                  ^
/var/tmp/portage/app-backup/bareos-21.1.5-r2/work/bareos-Release-21.1.5/core/src/cats/cats.h: In constructor ‘BareosSqlError::BareosSqlError(const char*)’:
/var/tmp/portage/app-backup/bareos-21.1.5-r2/work/bareos-Release-21.1.5/core/src/cats/cats.h:493:56: error: expected class-name before ‘(’ token
  493 |   BareosSqlError(const char* what) : std::runtime_error(what) {}
      |                                                        ^
/var/tmp/portage/app-backup/bareos-21.1.5-r2/work/bareos-Release-21.1.5/core/src/cats/cats.h:493:56: error: expected ‘{’ before ‘(’ token
[40/362] /usr/bin/x86_64-pc-linux-gnu-g++ -D_BDB_PRIV_INTERFACE_ -D_FILE_OFFSET_BITS=64 -Dbareossql_EXPORTS -I/usr/include/tirpc -I/var/tmp/portage/app-backup/bareos-21.1.5-r2/work/bareos-Release-21.1.5/core/src -I/usr/include/postgresql  -O2 -march=x86-64 -pipe -pipe -frecord-gcc-switches -fno-diagnostics-color -fmessage-length=0 -Wsuggest-override -Wformat -Wformat-security -fdebug-prefix-map=/var/tmp/portage/app-backup/bareos-21.1.5-r2/work/bareos-Release-21.1.5/core=. -fmacro-prefix-map=/var/tmp/portage/app-backup/bareos-21.1.5-r2/work/bareos-Release-21.1.5/core=. -Wno-unknown-pragmas -Wall -fPIC -Wno-deprecated-declarations -std=gnu++17 -MD -MT core/src/cats/CMakeFiles/bareossql.dir/sql_pooling.cc.o -MF core/src/cats/CMakeFiles/bareossql.dir/sql_pooling.cc.o.d -o core/src/cats/CMakeFiles/bareossql.dir/sql_pooling.cc.o -c /var/tmp/portage/app-backup/bareos-21.1.5-r2/work/bareos-Release-21.1.5/core/src/cats/sql_pooling.cc
FAILED: core/src/cats/CMakeFiles/bareossql.dir/sql_pooling.cc.o 
/usr/bin/x86_64-pc-linux-gnu-g++ -D_BDB_PRIV_INTERFACE_ -D_FILE_OFFSET_BITS=64 -Dbareossql_EXPORTS -I/usr/include/tirpc -I/var/tmp/portage/app-backup/bareos-21.1.5-r2/work/bareos-Release-21.1.5/core/src -I/usr/include/postgresql  -O2 -march=x86-64 -pipe -pipe -frecord-gcc-switches -fno-diagnostics-color -fmessage-length=0 -Wsuggest-override -Wformat -Wformat-security -fdebug-prefix-map=/var/tmp/portage/app-backup/bareos-21.1.5-r2/work/bareos-Release-21.1.5/core=. -fmacro-prefix-map=/var/tmp/portage/app-backup/bareos-21.1.5-r2/work/bareos-Release-21.1.5/core=. -Wno-unknown-pragmas -Wall -fPIC -Wno-deprecated-declarations -std=gnu++17 -MD -MT core/src/cats/CMakeFiles/bareossql.dir/sql_pooling.cc.o -MF core/src/cats/CMakeFiles/bareossql.dir/sql_pooling.cc.o.d -o core/src/cats/CMakeFiles/bareossql.dir/sql_pooling.cc.o -c /var/tmp/portage/app-backup/bareos-21.1.5-r2/work/bareos-Release-21.1.5/core/src/cats/sql_pooling.cc
In file included from /var/tmp/portage/app-backup/bareos-21.1.5-r2/work/bareos-Release-21.1.5/core/src/cats/sql_pooling.cc:33:
/var/tmp/portage/app-backup/bareos-21.1.5-r2/work/bareos-Release-21.1.5/core/src/cats/cats.h:491:50: error: expected class-name before ‘{’ token
  491 | class BareosSqlError : public std::runtime_error {
      |                                                  ^
/var/tmp/portage/app-backup/bareos-21.1.5-r2/work/bareos-Release-21.1.5/core/src/cats/cats.h: In constructor ‘BareosSqlError::BareosSqlError(const char*)’:
/var/tmp/portage/app-backup/bareos-21.1.5-r2/work/bareos-Release-21.1.5/core/src/cats/cats.h:493:56: error: expected class-name before ‘(’ token
  493 |   BareosSqlError(const char* what) : std::runtime_error(what) {}
      |                                                        ^
/var/tmp/portage/app-backup/bareos-21.1.5-r2/work/bareos-Release-21.1.5/core/src/cats/cats.h:493:56: error: expected ‘{’ before ‘(’ token
[41/362] /usr/bin/x86_64-pc-linux-gnu-g++ -D_BDB_PRIV_INTERFACE_ -D_FILE_OFFSET_BITS=64 -Dbareossql_EXPORTS -I/usr/include/tirpc -I/var/tmp/portage/app-backup/bareos-21.1.5-r2/work/bareos-Release-21.1.5/core/src -I/usr/include/postgresql  -O2 -march=x86-64 -pipe -pipe -frecord-gcc-switches -fno-diagnostics-color -fmessage-length=0 -Wsuggest-override -Wformat -Wformat-security -fdebug-prefix-map=/var/tmp/portage/app-backup/bareos-21.1.5-r2/work/bareos-Release-21.1.5/core=. -fmacro-prefix-map=/var/tmp/portage/app-backup/bareos-21.1.5-r2/work/bareos-Release-21.1.5/core=. -Wno-unknown-pragmas -Wall -fPIC -Wno-deprecated-declarations -std=gnu++17 -MD -MT core/src/cats/CMakeFiles/bareossql.dir/sql_update.cc.o -MF core/src/cats/CMakeFiles/bareossql.dir/sql_update.cc.o.d -o core/src/cats/CMakeFiles/bareossql.dir/sql_update.cc.o -c /var/tmp/portage/app-backup/bareos-21.1.5-r2/work/bareos-Release-21.1.5/core/src/cats/sql_update.cc
FAILED: core/src/cats/CMakeFiles/bareossql.dir/sql_update.cc.o 
/usr/bin/x86_64-pc-linux-gnu-g++ -D_BDB_PRIV_INTERFACE_ -D_FILE_OFFSET_BITS=64 -Dbareossql_EXPORTS -I/usr/include/tirpc -I/var/tmp/portage/app-backup/bareos-21.1.5-r2/work/bareos-Release-21.1.5/core/src -I/usr/include/postgresql  -O2 -march=x86-64 -pipe -pipe -frecord-gcc-switches -fno-diagnostics-color -fmessage-length=0 -Wsuggest-override -Wformat -Wformat-security -fdebug-prefix-map=/var/tmp/portage/app-backup/bareos-21.1.5-r2/work/bareos-Release-21.1.5/core=. -fmacro-prefix-map=/var/tmp/portage/app-backup/bareos-21.1.5-r2/work/bareos-Release-21.1.5/core=. -Wno-unknown-pragmas -Wall -fPIC -Wno-deprecated-declarations -std=gnu++17 -MD -MT core/src/cats/CMakeFiles/bareossql.dir/sql_update.cc.o -MF core/src/cats/CMakeFiles/bareossql.dir/sql_update.cc.o.d -o core/src/cats/CMakeFiles/bareossql.dir/sql_update.cc.o -c /var/tmp/portage/app-backup/bareos-21.1.5-r2/work/bareos-Release-21.1.5/core/src/cats/sql_update.cc
In file included from /var/tmp/portage/app-backup/bareos-21.1.5-r2/work/bareos-Release-21.1.5/core/src/cats/sql_update.cc:33:
/var/tmp/portage/app-backup/bareos-21.1.5-r2/work/bareos-Release-21.1.5/core/src/cats/cats.h:491:50: error: expected class-name before ‘{’ token
  491 | class BareosSqlError : public std::runtime_error {
      |                                                  ^
/var/tmp/portage/app-backup/bareos-21.1.5-r2/work/bareos-Release-21.1.5/core/src/cats/cats.h: In constructor ‘BareosSqlError::BareosSqlError(const char*)’:
/var/tmp/portage/app-backup/bareos-21.1.5-r2/work/bareos-Release-21.1.5/core/src/cats/cats.h:493:56: error: expected class-name before ‘(’ token
  493 |   BareosSqlError(const char* what) : std::runtime_error(what) {}
      |                                                        ^
/var/tmp/portage/app-backup/bareos-21.1.5-r2/work/bareos-Release-21.1.5/core/src/cats/cats.h:493:56: error: expected ‘{’ before ‘(’ token
[42/362] /usr/bin/x86_64-pc-linux-gnu-g++ -D_BDB_PRIV_INTERFACE_ -D_FILE_OFFSET_BITS=64 -Dbareoscats_EXPORTS -I/usr/include/tirpc -I/var/tmp/portage/app-backup/bareos-21.1.5-r2/work/bareos-Release-21.1.5/core/src -I/usr/include/postgresql  -O2 -march=x86-64 -pipe -pipe -frecord-gcc-switches -fno-diagnostics-color -fmessage-length=0 -Wsuggest-override -Wformat -Wformat-security -fdebug-prefix-map=/var/tmp/portage/app-backup/bareos-21.1.5-r2/work/bareos-Release-21.1.5/core=. -fmacro-prefix-map=/var/tmp/portage/app-backup/bareos-21.1.5-r2/work/bareos-Release-21.1.5/core=. -Wno-unknown-pragmas -Wall -fPIC -Wno-deprecated-declarations -std=gnu++17 -MD -MT core/src/cats/CMakeFiles/bareoscats.dir/cats_backends.cc.o -MF core/src/cats/CMakeFiles/bareoscats.dir/cats_backends.cc.o.d -o core/src/cats/CMakeFiles/bareoscats.dir/cats_backends.cc.o -c /var/tmp/portage/app-backup/bareos-21.1.5-r2/work/bareos-Release-21.1.5/core/src/cats/cats_backends.cc
FAILED: core/src/cats/CMakeFiles/bareoscats.dir/cats_backends.cc.o 
/usr/bin/x86_64-pc-linux-gnu-g++ -D_BDB_PRIV_INTERFACE_ -D_FILE_OFFSET_BITS=64 -Dbareoscats_EXPORTS -I/usr/include/tirpc -I/var/tmp/portage/app-backup/bareos-21.1.5-r2/work/bareos-Release-21.1.5/core/src -I/usr/include/postgresql  -O2 -march=x86-64 -pipe -pipe -frecord-gcc-switches -fno-diagnostics-color -fmessage-length=0 -Wsuggest-override -Wformat -Wformat-security -fdebug-prefix-map=/var/tmp/portage/app-backup/bareos-21.1.5-r2/work/bareos-Release-21.1.5/core=. -fmacro-prefix-map=/var/tmp/portage/app-backup/bareos-21.1.5-r2/work/bareos-Release-21.1.5/core=. -Wno-unknown-pragmas -Wall -fPIC -Wno-deprecated-declarations -std=gnu++17 -MD -MT core/src/cats/CMakeFiles/bareoscats.dir/cats_backends.cc.o -MF core/src/cats/CMakeFiles/bareoscats.dir/cats_backends.cc.o.d -o core/src/cats/CMakeFiles/bareoscats.dir/cats_backends.cc.o -c /var/tmp/portage/app-backup/bareos-21.1.5-r2/work/bareos-Release-21.1.5/core/src/cats/cats_backends.cc
In file included from /var/tmp/portage/app-backup/bareos-21.1.5-r2/work/bareos-Release-21.1.5/core/src/cats/cats_backends.cc:33:
/var/tmp/portage/app-backup/bareos-21.1.5-r2/work/bareos-Release-21.1.5/core/src/cats/cats.h:491:50: error: expected class-name before ‘{’ token
  491 | class BareosSqlError : public std::runtime_error {
      |                                                  ^
/var/tmp/portage/app-backup/bareos-21.1.5-r2/work/bareos-Release-21.1.5/core/src/cats/cats.h: In constructor ‘BareosSqlError::BareosSqlError(const char*)’:
/var/tmp/portage/app-backup/bareos-21.1.5-r2/work/bareos-Release-21.1.5/core/src/cats/cats.h:493:56: error: expected class-name before ‘(’ token
  493 |   BareosSqlError(const char* what) : std::runtime_error(what) {}
      |                                                        ^
/var/tmp/portage/app-backup/bareos-21.1.5-r2/work/bareos-Release-21.1.5/core/src/cats/cats.h:493:56: error: expected ‘{’ before ‘(’ token
[43/362] /usr/bin/x86_64-pc-linux-gnu-g++ -D_BDB_PRIV_INTERFACE_ -D_FILE_OFFSET_BITS=64 -Dbareoscats_postgresql_EXPORTS -I/usr/include/tirpc -I/var/tmp/portage/app-backup/bareos-21.1.5-r2/work/bareos-Release-21.1.5/core/src -I/usr/include/postgresql  -O2 -march=x86-64 -pipe -pipe -frecord-gcc-switches -fno-diagnostics-color -fmessage-length=0 -Wsuggest-override -Wformat -Wformat-security -fdebug-prefix-map=/var/tmp/portage/app-backup/bareos-21.1.5-r2/work/bareos-Release-21.1.5/core=. -fmacro-prefix-map=/var/tmp/portage/app-backup/bareos-21.1.5-r2/work/bareos-Release-21.1.5/core=. -Wno-unknown-pragmas -Wall -fPIC -Wno-deprecated-declarations -std=gnu++17 -MD -MT core/src/cats/CMakeFiles/bareoscats-postgresql.dir/postgresql.cc.o -MF core/src/cats/CMakeFiles/bareoscats-postgresql.dir/postgresql.cc.o.d -o core/src/cats/CMakeFiles/bareoscats-postgresql.dir/postgresql.cc.o -c /var/tmp/portage/app-backup/bareos-21.1.5-r2/work/bareos-Release-21.1.5/core/src/cats/postgresql.cc
FAILED: core/src/cats/CMakeFiles/bareoscats-postgresql.dir/postgresql.cc.o 
/usr/bin/x86_64-pc-linux-gnu-g++ -D_BDB_PRIV_INTERFACE_ -D_FILE_OFFSET_BITS=64 -Dbareoscats_postgresql_EXPORTS -I/usr/include/tirpc -I/var/tmp/portage/app-backup/bareos-21.1.5-r2/work/bareos-Release-21.1.5/core/src -I/usr/include/postgresql  -O2 -march=x86-64 -pipe -pipe -frecord-gcc-switches -fno-diagnostics-color -fmessage-length=0 -Wsuggest-override -Wformat -Wformat-security -fdebug-prefix-map=/var/tmp/portage/app-backup/bareos-21.1.5-r2/work/bareos-Release-21.1.5/core=. -fmacro-prefix-map=/var/tmp/portage/app-backup/bareos-21.1.5-r2/work/bareos-Release-21.1.5/core=. -Wno-unknown-pragmas -Wall -fPIC -Wno-deprecated-declarations -std=gnu++17 -MD -MT core/src/cats/CMakeFiles/bareoscats-postgresql.dir/postgresql.cc.o -MF core/src/cats/CMakeFiles/bareoscats-postgresql.dir/postgresql.cc.o.d -o core/src/cats/CMakeFiles/bareoscats-postgresql.dir/postgresql.cc.o -c /var/tmp/portage/app-backup/bareos-21.1.5-r2/work/bareos-Release-21.1.5/core/src/cats/postgresql.cc
In file included from /var/tmp/portage/app-backup/bareos-21.1.5-r2/work/bareos-Release-21.1.5/core/src/cats/postgresql.cc:38:
/var/tmp/portage/app-backup/bareos-21.1.5-r2/work/bareos-Release-21.1.5/core/src/cats/cats.h:491:50: error: expected class-name before ‘{’ token
  491 | class BareosSqlError : public std::runtime_error {
      |                                                  ^
/var/tmp/portage/app-backup/bareos-21.1.5-r2/work/bareos-Release-21.1.5/core/src/cats/cats.h: In constructor ‘BareosSqlError::BareosSqlError(const char*)’:
/var/tmp/portage/app-backup/bareos-21.1.5-r2/work/bareos-Release-21.1.5/core/src/cats/cats.h:493:56: error: expected class-name before ‘(’ token
  493 |   BareosSqlError(const char* what) : std::runtime_error(what) {}
      |                                                        ^
/var/tmp/portage/app-backup/bareos-21.1.5-r2/work/bareos-Release-21.1.5/core/src/cats/cats.h:493:56: error: expected ‘{’ before ‘(’ token
[44/362] /usr/bin/x86_64-pc-linux-gnu-g++ -D_BDB_PRIV_INTERFACE_ -D_FILE_OFFSET_BITS=64 -Dbareoscats_postgresql_EXPORTS -I/usr/include/tirpc -I/var/tmp/portage/app-backup/bareos-21.1.5-r2/work/bareos-Release-21.1.5/core/src -I/usr/include/postgresql  -O2 -march=x86-64 -pipe -pipe -frecord-gcc-switches -fno-diagnostics-color -fmessage-length=0 -Wsuggest-override -Wformat -Wformat-security -fdebug-prefix-map=/var/tmp/portage/app-backup/bareos-21.1.5-r2/work/bareos-Release-21.1.5/core=. -fmacro-prefix-map=/var/tmp/portage/app-backup/bareos-21.1.5-r2/work/bareos-Release-21.1.5/core=. -Wno-unknown-pragmas -Wall -fPIC -Wno-deprecated-declarations -std=gnu++17 -MD -MT core/src/cats/CMakeFiles/bareoscats-postgresql.dir/postgresql_batch.cc.o -MF core/src/cats/CMakeFiles/bareoscats-postgresql.dir/postgresql_batch.cc.o.d -o core/src/cats/CMakeFiles/bareoscats-postgresql.dir/postgresql_batch.cc.o -c /var/tmp/portage/app-backup/bareos-21.1.5-r2/work/bareos-Release-21.1.5/core/src/cats/postgresql_batch.cc
FAILED: core/src/cats/CMakeFiles/bareoscats-postgresql.dir/postgresql_batch.cc.o 
/usr/bin/x86_64-pc-linux-gnu-g++ -D_BDB_PRIV_INTERFACE_ -D_FILE_OFFSET_BITS=64 -Dbareoscats_postgresql_EXPORTS -I/usr/include/tirpc -I/var/tmp/portage/app-backup/bareos-21.1.5-r2/work/bareos-Release-21.1.5/core/src -I/usr/include/postgresql  -O2 -march=x86-64 -pipe -pipe -frecord-gcc-switches -fno-diagnostics-color -fmessage-length=0 -Wsuggest-override -Wformat -Wformat-security -fdebug-prefix-map=/var/tmp/portage/app-backup/bareos-21.1.5-r2/work/bareos-Release-21.1.5/core=. -fmacro-prefix-map=/var/tmp/portage/app-backup/bareos-21.1.5-r2/work/bareos-Release-21.1.5/core=. -Wno-unknown-pragmas -Wall -fPIC -Wno-deprecated-declarations -std=gnu++17 -MD -MT core/src/cats/CMakeFiles/bareoscats-postgresql.dir/postgresql_batch.cc.o -MF core/src/cats/CMakeFiles/bareoscats-postgresql.dir/postgresql_batch.cc.o.d -o core/src/cats/CMakeFiles/bareoscats-postgresql.dir/postgresql_batch.cc.o -c /var/tmp/portage/app-backup/bareos-21.1.5-r2/work/bareos-Release-21.1.5/core/src/cats/postgresql_batch.cc
In file included from /var/tmp/portage/app-backup/bareos-21.1.5-r2/work/bareos-Release-21.1.5/core/src/cats/postgresql_batch.cc:28:
/var/tmp/portage/app-backup/bareos-21.1.5-r2/work/bareos-Release-21.1.5/core/src/cats/cats.h:491:50: error: expected class-name before ‘{’ token
  491 | class BareosSqlError : public std::runtime_error {
      |                                                  ^
/var/tmp/portage/app-backup/bareos-21.1.5-r2/work/bareos-Release-21.1.5/core/src/cats/cats.h: In constructor ‘BareosSqlError::BareosSqlError(const char*)’:
/var/tmp/portage/app-backup/bareos-21.1.5-r2/work/bareos-Release-21.1.5/core/src/cats/cats.h:493:56: error: expected class-name before ‘(’ token
  493 |   BareosSqlError(const char* what) : std::runtime_error(what) {}
      |                                                        ^
/var/tmp/portage/app-backup/bareos-21.1.5-r2/work/bareos-Release-21.1.5/core/src/cats/cats.h:493:56: error: expected ‘{’ before ‘(’ token
[45/362] /usr/bin/x86_64-pc-linux-gnu-g++ -D_BDB_PRIV_INTERFACE_ -D_FILE_OFFSET_BITS=64 -Dbareoscats_postgresql_EXPORTS -I/usr/include/tirpc -I/var/tmp/portage/app-backup/bareos-21.1.5-r2/work/bareos-Release-21.1.5/core/src -I/usr/include/postgresql  -O2 -march=x86-64 -pipe -pipe -frecord-gcc-switches -fno-diagnostics-color -fmessage-length=0 -Wsuggest-override -Wformat -Wformat-security -fdebug-prefix-map=/var/tmp/portage/app-backup/bareos-21.1.5-r2/work/bareos-Release-21.1.5/core=. -fmacro-prefix-map=/var/tmp/portage/app-backup/bareos-21.1.5-r2/work/bareos-Release-21.1.5/core=. -Wno-unknown-pragmas -Wall -fPIC -Wno-deprecated-declarations -std=gnu++17 -MD -MT core/src/cats/CMakeFiles/bareoscats-postgresql.dir/cats_backends.cc.o -MF core/src/cats/CMakeFiles/bareoscats-postgresql.dir/cats_backends.cc.o.d -o core/src/cats/CMakeFiles/bareoscats-postgresql.dir/cats_backends.cc.o -c /var/tmp/portage/app-backup/bareos-21.1.5-r2/work/bareos-Release-21.1.5/core/src/cats/cats_backends.cc
FAILED: core/src/cats/CMakeFiles/bareoscats-postgresql.dir/cats_backends.cc.o 
/usr/bin/x86_64-pc-linux-gnu-g++ -D_BDB_PRIV_INTERFACE_ -D_FILE_OFFSET_BITS=64 -Dbareoscats_postgresql_EXPORTS -I/usr/include/tirpc -I/var/tmp/portage/app-backup/bareos-21.1.5-r2/work/bareos-Release-21.1.5/core/src -I/usr/include/postgresql  -O2 -march=x86-64 -pipe -pipe -frecord-gcc-switches -fno-diagnostics-color -fmessage-length=0 -Wsuggest-override -Wformat -Wformat-security -fdebug-prefix-map=/var/tmp/portage/app-backup/bareos-21.1.5-r2/work/bareos-Release-21.1.5/core=. -fmacro-prefix-map=/var/tmp/portage/app-backup/bareos-21.1.5-r2/work/bareos-Release-21.1.5/core=. -Wno-unknown-pragmas -Wall -fPIC -Wno-deprecated-declarations -std=gnu++17 -MD -MT core/src/cats/CMakeFiles/bareoscats-postgresql.dir/cats_backends.cc.o -MF core/src/cats/CMakeFiles/bareoscats-postgresql.dir/cats_backends.cc.o.d -o core/src/cats/CMakeFiles/bareoscats-postgresql.dir/cats_backends.cc.o -c /var/tmp/portage/app-backup/bareos-21.1.5-r2/work/bareos-Release-21.1.5/core/src/cats/cats_backends.cc
In file included from /var/tmp/portage/app-backup/bareos-21.1.5-r2/work/bareos-Release-21.1.5/core/src/cats/cats_backends.cc:33:
/var/tmp/portage/app-backup/bareos-21.1.5-r2/work/bareos-Release-21.1.5/core/src/cats/cats.h:491:50: error: expected class-name before ‘{’ token
  491 | class BareosSqlError : public std::runtime_error {
      |                                                  ^
/var/tmp/portage/app-backup/bareos-21.1.5-r2/work/bareos-Release-21.1.5/core/src/cats/cats.h: In constructor ‘BareosSqlError::BareosSqlError(const char*)’:
/var/tmp/portage/app-backup/bareos-21.1.5-r2/work/bareos-Release-21.1.5/core/src/cats/cats.h:493:56: error: expected class-name before ‘(’ token
  493 |   BareosSqlError(const char* what) : std::runtime_error(what) {}
      |                                                        ^
/var/tmp/portage/app-backup/bareos-21.1.5-r2/work/bareos-Release-21.1.5/core/src/cats/cats.h:493:56: error: expected ‘{’ before ‘(’ token
ninja: build stopped: subcommand failed.
 * ERROR: app-backup/bareos-21.1.5-r2::gentoo failed (compile phase):
 *   ninja -v -j16 -l0 failed
 * 
 * Call stack:
 *     ebuild.sh, line  136:  Called src_compile
 *   environment, line 3298:  Called cmake_src_compile
 *   environment, line 1381:  Called cmake_build
 *   environment, line 1350:  Called eninja
 *   environment, line 1864:  Called die
 * The specific snippet of code:
 *       "$@" || die -n "${*} failed"
 * 
 * If you need support, post the output of `emerge --info '=app-backup/bareos-21.1.5-r2::gentoo'`,
 * the complete build log and the output of `emerge -pqv '=app-backup/bareos-21.1.5-r2::gentoo'`.
 * The complete build log is located at '/var/log/emerge-log/build/app-backup/bareos-21.1.5-r2:20230217-201904.log'.
 * For convenience, a symlink to the build log is located at '/var/tmp/portage/app-backup/bareos-21.1.5-r2/temp/build.log'.
 * The ebuild environment file is located at '/var/tmp/portage/app-backup/bareos-21.1.5-r2/temp/environment'.
 * Working directory: '/var/tmp/portage/app-backup/bareos-21.1.5-r2/work/bareos-21.1.5_build'
 * S: '/var/tmp/portage/app-backup/bareos-21.1.5-r2/work/bareos-Release-21.1.5'